{"text_format":"1","workbook":"xlsx","n_sheets":7,"sheets":["Seeding","PoolsPrint","SheetsPrint","Scoring","ResPrint","Results","ToDo"],"not_rendered":{"charts":0,"images":0,"macros":1,"external_links":0,"defined_names":4,"comments":1,"pivot_tables":0},"unopened":[],"bounds":{"document_bytes":16777216,"sheet_cells":100000,"rows_first":2000,"rows_last":500,"rows_between":2000,"halvings":0,"cell_chars":16384,"cell_head_chars":4096},"cells_cut":0,"cells_raw":0,"read":"whole","date_system":"1900"}

{"sheet":"Seeding","index":0,"n_rows":11,"n_cols":8,"rows_kept":11,"cut":false,"hidden":false,"merged":[]}
["Name","Seed"]
["Player 1",1]
["Player 2",2]
["Player 3",3]
["Player 4",4,null,"Number of players",{"$f":"COUNT(B:B)","v":10},null,"Name of the event","2012 IFPA U.S. Open Freestyle Championships"]
["Player 5",5,null,"Number of pools",2,null,"Category/round","Open Singles Routines - Round 1"]
["Player 6",6]
["Player 7",7,null,{"$f":"IF(OR(E6>8,E6<1),\"Illegal number of pools! (1-8)\",\"\")","v":""}]
["Player 8",8,null,{"$f":"IF(E5>80,\"Too many players…\",\"\")","v":""}]
["Player 9",9,null,{"$f":"IF(E5/E6>10,\"Too many players per pool! (max 10)\",\"\")","v":""}]
["Player 10",10,null,{"$f":"IF(E6>E5,\"Too many pools!\",\"\")","v":""}]

{"sheet":"PoolsPrint","index":1,"n_rows":27,"n_cols":4,"rows_kept":27,"cut":false,"hidden":false,"merged":[[0,0,0,3],[2,0,2,3]]}
[{"$f":"Seeding!H5","v":"2012 IFPA U.S. Open Freestyle Championships"}]
[]
[{"$f":"Seeding!H6","v":"Open Singles Routines - Round 1"}]
["Tue. 1:30pm","Tue. 1:50pm","Tue. 2:10pm","Tue. 2:30pm"]
["Pool A","Pool B","Pool C","Pool D"]
[{"$f":"IF(Scoring!$A2<>\"\",Scoring!$A2,\"\")","v":""},{"$f":"IF(Scoring!$A13<>\"\",Scoring!$A13,\"\")","v":""},{"$f":"IF(Scoring!$A24<>\"\",Scoring!$A24,\"\")","v":""},{"$f":"IF(Scoring!$A35<>\"\",Scoring!$A35,\"\")","v":""}]
[{"$f":"IF(Scoring!$A3<>\"\",Scoring!$A3,\"\")","v":""},{"$f":"IF(Scoring!$A14<>\"\",Scoring!$A14,\"\")","v":""},{"$f":"IF(Scoring!$A25<>\"\",Scoring!$A25,\"\")","v":""},{"$f":"IF(Scoring!$A36<>\"\",Scoring!$A36,\"\")","v":""}]
[{"$f":"IF(Scoring!$A4<>\"\",Scoring!$A4,\"\")","v":""},{"$f":"IF(Scoring!$A15<>\"\",Scoring!$A15,\"\")","v":""},{"$f":"IF(Scoring!$A26<>\"\",Scoring!$A26,\"\")","v":""},{"$f":"IF(Scoring!$A37<>\"\",Scoring!$A37,\"\")","v":""}]
[{"$f":"IF(Scoring!$A5<>\"\",Scoring!$A5,\"\")","v":""},{"$f":"IF(Scoring!$A16<>\"\",Scoring!$A16,\"\")","v":""},{"$f":"IF(Scoring!$A27<>\"\",Scoring!$A27,\"\")","v":""},{"$f":"IF(Scoring!$A38<>\"\",Scoring!$A38,\"\")","v":""}]
[{"$f":"IF(Scoring!$A6<>\"\",Scoring!$A6,\"\")","v":""},{"$f":"IF(Scoring!$A17<>\"\",Scoring!$A17,\"\")","v":""},{"$f":"IF(Scoring!$A28<>\"\",Scoring!$A28,\"\")","v":""},{"$f":"IF(Scoring!$A39<>\"\",Scoring!$A39,\"\")","v":""}]
[{"$f":"IF(Scoring!$A7<>\"\",Scoring!$A7,\"\")","v":"Player 10"},{"$f":"IF(Scoring!$A18<>\"\",Scoring!$A18,\"\")","v":"Player 9"},{"$f":"IF(Scoring!$A29<>\"\",Scoring!$A29,\"\")","v":""},{"$f":"IF(Scoring!$A40<>\"\",Scoring!$A40,\"\")","v":""}]
[{"$f":"IF(Scoring!$A8<>\"\",Scoring!$A8,\"\")","v":"Player 7"},{"$f":"IF(Scoring!$A19<>\"\",Scoring!$A19,\"\")","v":"Player 8"},{"$f":"IF(Scoring!$A30<>\"\",Scoring!$A30,\"\")","v":""},{"$f":"IF(Scoring!$A41<>\"\",Scoring!$A41,\"\")","v":""}]
[{"$f":"IF(Scoring!$A9<>\"\",Scoring!$A9,\"\")","v":"Player 6"},{"$f":"IF(Scoring!$A20<>\"\",Scoring!$A20,\"\")","v":"Player 5"},{"$f":"IF(Scoring!$A31<>\"\",Scoring!$A31,\"\")","v":""},{"$f":"IF(Scoring!$A42<>\"\",Scoring!$A42,\"\")","v":""}]
[{"$f":"IF(Scoring!$A10<>\"\",Scoring!$A10,\"\")","v":"Player 3"},{"$f":"IF(Scoring!$A21<>\"\",Scoring!$A21,\"\")","v":"Player 4"},{"$f":"IF(Scoring!$A32<>\"\",Scoring!$A32,\"\")","v":""},{"$f":"IF(Scoring!$A43<>\"\",Scoring!$A43,\"\")","v":""}]
[{"$f":"IF(Scoring!$A11<>\"\",Scoring!$A11,\"\")","v":"Player 2"},{"$f":"IF(Scoring!$A22<>\"\",Scoring!$A22,\"\")","v":"Player 1"},{"$f":"IF(Scoring!$A33<>\"\",Scoring!$A33,\"\")","v":""},{"$f":"IF(Scoring!$A44<>\"\",Scoring!$A44,\"\")","v":""}]
[]
["Pool E","Pool F","Pool G","Pool H"]
[{"$f":"IF(Scoring!$A46<>\"\",Scoring!$A46,\"\")","v":""},{"$f":"IF(Scoring!$A57<>\"\",Scoring!$A57,\"\")","v":""},{"$f":"IF(Scoring!$A68<>\"\",Scoring!$A68,\"\")","v":""},{"$f":"IF(Scoring!$A79<>\"\",Scoring!$A79,\"\")","v":""}]
[{"$f":"IF(Scoring!$A47<>\"\",Scoring!$A47,\"\")","v":""},{"$f":"IF(Scoring!$A58<>\"\",Scoring!$A58,\"\")","v":""},{"$f":"IF(Scoring!$A69<>\"\",Scoring!$A69,\"\")","v":""},{"$f":"IF(Scoring!$A80<>\"\",Scoring!$A80,\"\")","v":""}]
[{"$f":"IF(Scoring!$A48<>\"\",Scoring!$A48,\"\")","v":""},{"$f":"IF(Scoring!$A59<>\"\",Scoring!$A59,\"\")","v":""},{"$f":"IF(Scoring!$A70<>\"\",Scoring!$A70,\"\")","v":""},{"$f":"IF(Scoring!$A81<>\"\",Scoring!$A81,\"\")","v":""}]
[{"$f":"IF(Scoring!$A49<>\"\",Scoring!$A49,\"\")","v":""},{"$f":"IF(Scoring!$A60<>\"\",Scoring!$A60,\"\")","v":""},{"$f":"IF(Scoring!$A71<>\"\",Scoring!$A71,\"\")","v":""},{"$f":"IF(Scoring!$A82<>\"\",Scoring!$A82,\"\")","v":""}]
[{"$f":"IF(Scoring!$A50<>\"\",Scoring!$A50,\"\")","v":""},{"$f":"IF(Scoring!$A61<>\"\",Scoring!$A61,\"\")","v":""},{"$f":"IF(Scoring!$A72<>\"\",Scoring!$A72,\"\")","v":""},{"$f":"IF(Scoring!$A83<>\"\",Scoring!$A83,\"\")","v":""}]
[{"$f":"IF(Scoring!$A51<>\"\",Scoring!$A51,\"\")","v":""},{"$f":"IF(Scoring!$A62<>\"\",Scoring!$A62,\"\")","v":""},{"$f":"IF(Scoring!$A73<>\"\",Scoring!$A73,\"\")","v":""},{"$f":"IF(Scoring!$A84<>\"\",Scoring!$A84,\"\")","v":""}]
[{"$f":"IF(Scoring!$A52<>\"\",Scoring!$A52,\"\")","v":""},{"$f":"IF(Scoring!$A63<>\"\",Scoring!$A63,\"\")","v":""},{"$f":"IF(Scoring!$A74<>\"\",Scoring!$A74,\"\")","v":""},{"$f":"IF(Scoring!$A85<>\"\",Scoring!$A85,\"\")","v":""}]
[{"$f":"IF(Scoring!$A53<>\"\",Scoring!$A53,\"\")","v":""},{"$f":"IF(Scoring!$A64<>\"\",Scoring!$A64,\"\")","v":""},{"$f":"IF(Scoring!$A75<>\"\",Scoring!$A75,\"\")","v":""},{"$f":"IF(Scoring!$A86<>\"\",Scoring!$A86,\"\")","v":""}]
[{"$f":"IF(Scoring!$A54<>\"\",Scoring!$A54,\"\")","v":""},{"$f":"IF(Scoring!$A65<>\"\",Scoring!$A65,\"\")","v":""},{"$f":"IF(Scoring!$A76<>\"\",Scoring!$A76,\"\")","v":""},{"$f":"IF(Scoring!$A87<>\"\",Scoring!$A87,\"\")","v":""}]
[{"$f":"IF(Scoring!$A55<>\"\",Scoring!$A55,\"\")","v":""},{"$f":"IF(Scoring!$A66<>\"\",Scoring!$A66,\"\")","v":""},{"$f":"IF(Scoring!$A77<>\"\",Scoring!$A77,\"\")","v":""},{"$f":"IF(Scoring!$A88<>\"\",Scoring!$A88,\"\")","v":""}]

{"sheet":"SheetsPrint","index":2,"n_rows":297,"n_cols":9,"rows_kept":297,"cut":false,"hidden":false,"merged":[[268,0,268,1],[269,0,269,1],[270,0,270,1],[271,0,271,1],[264,1,264,4],[265,1,265,4],[276,0,276,1],[277,0,277,1],[272,0,272,1],[273,0,273,1],[274,0,274,1],[275,0,275,1],[238,0,238,1],[231,0,231,1],[232,0,232,1],[233,0,233,1],[234,0,234,1],[265,5,265,8],[267,0,267,1],[239,0,239,1],[240,0,240,1],[261,7,261,8],[263,1,263,4],[263,6,263,7],[230,0,230,1],[202,0,202,1],[203,0,203,1],[224,7,224,8],[226,1,226,4],[226,6,226,7],[235,0,235,1],[236,0,236,1],[237,0,237,1],[200,0,200,1],[201,0,201,1],[194,0,194,1],[195,0,195,1],[196,0,196,1],[197,0,197,1],[227,1,227,4],[228,1,228,4],[228,5,228,8],[191,5,191,8],[193,0,193,1],[165,0,165,1],[166,0,166,1],[187,7,187,8],[189,1,189,4],[189,6,189,7],[198,0,198,1],[199,0,199,1],[162,0,162,1],[163,0,163,1],[164,0,164,1],[157,0,157,1],[158,0,158,1],[159,0,159,1],[160,0,160,1],[190,1,190,4],[191,1,191,4],[154,1,154,4],[154,5,154,8],[156,0,156,1],[128,0,128,1],[129,0,129,1],[150,7,150,8],[152,1,152,4],[152,6,152,7],[161,0,161,1],[124,0,124,1],[125,0,125,1],[126,0,126,1],[127,0,127,1],[120,0,120,1],[121,0,121,1],[122,0,122,1],[123,0,123,1],[153,1,153,4],[91,0,91,1],[84,0,84,1],[85,0,85,1],[86,0,86,1],[87,0,87,1],[116,1,116,4],[117,1,117,4],[117,5,117,8],[119,0,119,1],[92,0,92,1],[113,7,113,8],[115,1,115,4],[115,6,115,7],[82,0,82,1],[83,0,83,1],[76,7,76,8],[78,1,78,4],[78,6,78,7],[79,1,79,4],[88,0,88,1],[89,0,89,1],[90,0,90,1],[53,0,53,1],[54,0,54,1],[55,0,55,1],[48,0,48,1],[49,0,49,1],[50,0,50,1],[51,0,51,1],[80,1,80,4],[80,5,80,8],[42,5,42,8],[45,0,45,1],[46,0,46,1],[47,0,47,1],[38,7,38,8],[40,1,40,4],[40,6,40,7],[41,1,41,4],[52,0,52,1],[12,0,12,1],[7,0,7,1],[8,0,8,1],[15,0,15,1],[16,0,16,1],[17,0,17,1],[42,1,42,4],[13,0,13,1],[14,0,14,1],[0,7,0,8],[2,1,2,4],[4,1,4,4],[3,1,3,4],[2,6,2,7],[4,5,4,8],[9,0,9,1],[10,0,10,1],[11,0,11,1]]}
["Freestyle Judging Form"]
[]
["Event:",{"$f":"Seeding!$H$5","v":"2012 IFPA U.S. Open Freestyle Championships"},null,null,null,"Date:"]
["Discipline: ",null,null,null,null,"Round:",null,"Pool:","A"]
["Judge:",null,null,null,null,"Certified:   yes  no    (circle whether certified)"]
[]
[]
["Player/Team\n(Full Names)",null,"Drop Count","Trick Count","Avg. Difficulty","Artistic Interpretation (0.0-6.0) *","AI RANK","Technical\nMerit\n(0.0-6.0) * **","TM RANK"]
[{"$f":"IF(Scoring!A2<>\"\",Scoring!A2,\"\")","v":""}]
[{"$f":"IF(Scoring!A3<>\"\",Scoring!A3,\"\")","v":""}]
[{"$f":"IF(Scoring!A4<>\"\",Scoring!A4,\"\")","v":""}]
[{"$f":"IF(Scoring!A5<>\"\",Scoring!A5,\"\")","v":""}]
[{"$f":"IF(Scoring!A6<>\"\",Scoring!A6,\"\")","v":""}]
[{"$f":"IF(Scoring!A7<>\"\",Scoring!A7,\"\")","v":"Player 10"}]
[{"$f":"IF(Scoring!A8<>\"\",Scoring!A8,\"\")","v":"Player 7"}]
[{"$f":"IF(Scoring!A9<>\"\",Scoring!A9,\"\")","v":"Player 6"}]
[{"$f":"IF(Scoring!A10<>\"\",Scoring!A10,\"\")","v":"Player 3"}]
[{"$f":"IF(Scoring!A11<>\"\",Scoring!A11,\"\")","v":"Player 2"}]
[]
[]
["* AI","           0.0 = extremely poor (player incapable of artistry)"]
[null,"           1.0 = poor (player has some artistic ability, but not much)"]
[null,"           2.0 = weak (player is attempting performance, but lacks much skill)"]
[null,"           3.0 = reasonable (player may not be extremely artistic, but has routine, focusses on audience, etc.)"]
[null,"           4.0 = good (player demonstrates clear artistic ability, good audience appeal, unique style, good music, etc.)"]
[null,"           5.0 = very good (player demonstrates artistic mastery, very good audience appeal, and/or very good composure "]
[null,null,"and general form, etc.)"]
[null,"           6.0 = perfect (player combines artistic variety, excellent presentation and choreography, and solid"]
[null,null,"general form into an outstanding show)."]
["** TM","           0.0 = extremely poor (player incapable of technical play)"]
[null,"           1.0 = poor (player has some technical ability, but not much)"]
[null,"           2.0 = weak (player can hit some tricks, but lacks much skill)"]
[null,"           3.0 = reasonable (player may not be extremely technical, but has control, does a few tricks very well, etc.)"]
[null,"           4.0 = good (player demonstrates technical ability, good control, different types of tricks, etc.)"]
[null,"           5.0 = very good (player demonstrates technical mastery, wide variety of difficult tricks, and/or very good"]
[null,null,"execution of mastered tricks, etc.)"]
[null,"           6.0 = perfect (player combines variety, difficulty, execution, and form into an outstanding technical routine)."]
[]
["Freestyle Judging Form"]
[]
["Event:",{"$f":"Seeding!$H$5","v":"2012 IFPA U.S. Open Freestyle Championships"},null,null,null,"Date:"]
["Discipline: ",null,null,null,null,"Round:",null,"Pool:","B"]
["Judge:",null,null,null,null,"Certified:   yes  no    (circle whether certified)"]
[]
[]
["Player/Team\n(Full Names)",null,"Drop Count","Trick Count","Avg. Difficulty","Artistic Interpretation (0.0-6.0) *","AI RANK","Technical\nMerit\n(0.0-6.0) * **","TM RANK"]
[{"$f":"IF(Scoring!A13<>\"\",Scoring!A13,\"\")","v":""}]
[{"$f":"IF(Scoring!A14<>\"\",Scoring!A14,\"\")","v":""}]
[{"$f":"IF(Scoring!A15<>\"\",Scoring!A15,\"\")","v":""}]
[{"$f":"IF(Scoring!A16<>\"\",Scoring!A16,\"\")","v":""}]
[{"$f":"IF(Scoring!A17<>\"\",Scoring!A17,\"\")","v":""}]
[{"$f":"IF(Scoring!A18<>\"\",Scoring!A18,\"\")","v":"Player 9"}]
[{"$f":"IF(Scoring!A19<>\"\",Scoring!A19,\"\")","v":"Player 8"}]
[{"$f":"IF(Scoring!A20<>\"\",Scoring!A20,\"\")","v":"Player 5"}]
[{"$f":"IF(Scoring!A21<>\"\",Scoring!A21,\"\")","v":"Player 4"}]
[{"$f":"IF(Scoring!A22<>\"\",Scoring!A22,\"\")","v":"Player 1"}]
[]
[]
["* AI","           0.0 = extremely poor (player incapable of artistry)"]
[null,"           1.0 = poor (player has some artistic ability, but not much)"]
[null,"           2.0 = weak (player is attempting performance, but lacks much skill)"]
[null,"           3.0 = reasonable (player may not be extremely artistic, but has routine, focusses on audience, etc.)"]
[null,"           4.0 = good (player demonstrates clear artistic ability, good audience appeal, unique style, good music, etc.)"]
[null,"           5.0 = very good (player demonstrates artistic mastery, very good audience appeal, and/or very good composure "]
[null,null,"and general form, etc.)"]
[null,"           6.0 = perfect (player combines artistic variety, excellent presentation and choreography, and solid"]
[null,null,"general form into an outstanding show)."]
["** TM","           0.0 = extremely poor (player incapable of technical play)"]
[null,"           1.0 = poor (player has some technical ability, but not much)"]
[null,"           2.0 = weak (player can hit some tricks, but lacks much skill)"]
[null,"           3.0 = reasonable (player may not be extremely technical, but has control, does a few tricks very well, etc.)"]
[null,"           4.0 = good (player demonstrates technical ability, good control, different types of tricks, etc.)"]
[null,"           5.0 = very good (player demonstrates technical mastery, wide variety of difficult tricks, and/or very good"]
[null,null,"execution of mastered tricks, etc.)"]
[null,"           6.0 = perfect (player combines variety, difficulty, execution, and form into an outstanding technical routine)."]
[]
["Freestyle Judging Form"]
[]
["Event:",{"$f":"Seeding!$H$5","v":"2012 IFPA U.S. Open Freestyle Championships"},null,null,null,"Date:"]
["Discipline: ",null,null,null,null,"Round:",null,"Pool:","C"]
["Judge:",null,null,null,null,"Certified:   yes  no    (circle whether certified)"]
[]
["Player/Team\n(Full Names)",null,"Drop Count","Trick Count","Avg. Difficulty","Artistic Interpretation (0.0-6.0) *","AI RANK","Technical\nMerit\n(0.0-6.0) * **","TM RANK"]
[{"$f":"IF(Scoring!A24<>\"\",Scoring!A24,\"\")","v":""}]
[{"$f":"IF(Scoring!A25<>\"\",Scoring!A25,\"\")","v":""}]
[{"$f":"IF(Scoring!A26<>\"\",Scoring!A26,\"\")","v":""}]
[{"$f":"IF(Scoring!A27<>\"\",Scoring!A27,\"\")","v":""}]
[{"$f":"IF(Scoring!A28<>\"\",Scoring!A28,\"\")","v":""}]
[{"$f":"IF(Scoring!A29<>\"\",Scoring!A29,\"\")","v":""}]
[{"$f":"IF(Scoring!A30<>\"\",Scoring!A30,\"\")","v":""}]
[{"$f":"IF(Scoring!A31<>\"\",Scoring!A31,\"\")","v":""}]
[{"$f":"IF(Scoring!A32<>\"\",Scoring!A32,\"\")","v":""}]
[{"$f":"IF(Scoring!A33<>\"\",Scoring!A33,\"\")","v":""}]
[]
[]
["* AI","           0.0 = extremely poor (player incapable of artistry)"]
[null,"           1.0 = poor (player has some artistic ability, but not much)"]
[null,"           2.0 = weak (player is attempting performance, but lacks much skill)"]
[null,"           3.0 = reasonable (player may not be extremely artistic, but has routine, focusses on audience, etc.)"]
[null,"           4.0 = good (player demonstrates clear artistic ability, good audience appeal, unique style, good music, etc.)"]
[null,"           5.0 = very good (player demonstrates artistic mastery, very good audience appeal, and/or very good composure "]
[null,null,"and general form, etc.)"]
[null,"           6.0 = perfect (player combines artistic variety, excellent presentation and choreography, and solid"]
[null,null,"general form into an outstanding show)."]
["** TM","           0.0 = extremely poor (player incapable of technical play)"]
[null,"           1.0 = poor (player has some technical ability, but not much)"]
[null,"           2.0 = weak (player can hit some tricks, but lacks much skill)"]
[null,"           3.0 = reasonable (player may not be extremely technical, but has control, does a few tricks very well, etc.)"]
[null,"           4.0 = good (player demonstrates technical ability, good control, different types of tricks, etc.)"]
[null,"           5.0 = very good (player demonstrates technical mastery, wide variety of difficult tricks, and/or very good"]
[null,null,"execution of mastered tricks, etc.)"]
[null,"           6.0 = perfect (player combines variety, difficulty, execution, and form into an outstanding technical routine)."]
[]
["Freestyle Judging Form"]
[]
["Event:",{"$f":"Seeding!$H$5","v":"2012 IFPA U.S. Open Freestyle Championships"},null,null,null,"Date:"]
["Discipline: ",null,null,null,null,"Round:",null,"Pool:","D"]
["Judge:",null,null,null,null,"Certified:   yes  no    (circle whether certified)"]
[]
["Player/Team\n(Full Names)",null,"Drop Count","Trick Count","Avg. Difficulty","Artistic Interpretation (0.0-6.0) *","AI RANK","Technical\nMerit\n(0.0-6.0) * **","TM RANK"]
[{"$f":"IF(Scoring!A35<>\"\",Scoring!A35,\"\")","v":""}]
[{"$f":"IF(Scoring!A36<>\"\",Scoring!A36,\"\")","v":""}]
[{"$f":"IF(Scoring!A37<>\"\",Scoring!A37,\"\")","v":""}]
[{"$f":"IF(Scoring!A38<>\"\",Scoring!A38,\"\")","v":""}]
[{"$f":"IF(Scoring!A39<>\"\",Scoring!A39,\"\")","v":""}]
[{"$f":"IF(Scoring!A40<>\"\",Scoring!A40,\"\")","v":""}]
[{"$f":"IF(Scoring!A41<>\"\",Scoring!A41,\"\")","v":""}]
[{"$f":"IF(Scoring!A42<>\"\",Scoring!A42,\"\")","v":""}]
[{"$f":"IF(Scoring!A43<>\"\",Scoring!A43,\"\")","v":""}]
[{"$f":"IF(Scoring!A44<>\"\",Scoring!A44,\"\")","v":""}]
[]
[]
["* AI","           0.0 = extremely poor (player incapable of artistry)"]
[null,"           1.0 = poor (player has some artistic ability, but not much)"]
[null,"           2.0 = weak (player is attempting performance, but lacks much skill)"]
[null,"           3.0 = reasonable (player may not be extremely artistic, but has routine, focusses on audience, etc.)"]
[null,"           4.0 = good (player demonstrates clear artistic ability, good audience appeal, unique style, good music, etc.)"]
[null,"           5.0 = very good (player demonstrates artistic mastery, very good audience appeal, and/or very good composure "]
[null,null,"and general form, etc.)"]
[null,"           6.0 = perfect (player combines artistic variety, excellent presentation and choreography, and solid"]
[null,null,"general form into an outstanding show)."]
["** TM","           0.0 = extremely poor (player incapable of technical play)"]
[null,"           1.0 = poor (player has some technical ability, but not much)"]
[null,"           2.0 = weak (player can hit some tricks, but lacks much skill)"]
[null,"           3.0 = reasonable (player may not be extremely technical, but has control, does a few tricks very well, etc.)"]
[null,"           4.0 = good (player demonstrates technical ability, good control, different types of tricks, etc.)"]
[null,"           5.0 = very good (player demonstrates technical mastery, wide variety of difficult tricks, and/or very good"]
[null,null,"execution of mastered tricks, etc.)"]
[null,"           6.0 = perfect (player combines variety, difficulty, execution, and form into an outstanding technical routine)."]
[]
["Freestyle Judging Form"]
[]
["Event:",{"$f":"Seeding!$H$5","v":"2012 IFPA U.S. Open Freestyle Championships"},null,null,null,"Date:"]
["Discipline: ",null,null,null,null,"Round:",null,"Pool:","E"]
["Judge:",null,null,null,null,"Certified:   yes  no    (circle whether certified)"]
[]
["Player/Team\n(Full Names)",null,"Drop Count","Trick Count","Avg. Difficulty","Artistic Interpretation (0.0-6.0) *","AI RANK","Technical\nMerit\n(0.0-6.0) * **","TM RANK"]
[{"$f":"IF(Scoring!A46<>\"\",Scoring!A46,\"\")","v":""}]
[{"$f":"IF(Scoring!A47<>\"\",Scoring!A47,\"\")","v":""}]
[{"$f":"IF(Scoring!A48<>\"\",Scoring!A48,\"\")","v":""}]
[{"$f":"IF(Scoring!A49<>\"\",Scoring!A49,\"\")","v":""}]
[{"$f":"IF(Scoring!A50<>\"\",Scoring!A50,\"\")","v":""}]
[{"$f":"IF(Scoring!A51<>\"\",Scoring!A51,\"\")","v":""}]
[{"$f":"IF(Scoring!A52<>\"\",Scoring!A52,\"\")","v":""}]
[{"$f":"IF(Scoring!A53<>\"\",Scoring!A53,\"\")","v":""}]
[{"$f":"IF(Scoring!A54<>\"\",Scoring!A54,\"\")","v":""}]
[{"$f":"IF(Scoring!A55<>\"\",Scoring!A55,\"\")","v":""}]
[]
[]
["* AI","           0.0 = extremely poor (player incapable of artistry)"]
[null,"           1.0 = poor (player has some artistic ability, but not much)"]
[null,"           2.0 = weak (player is attempting performance, but lacks much skill)"]
[null,"           3.0 = reasonable (player may not be extremely artistic, but has routine, focusses on audience, etc.)"]
[null,"           4.0 = good (player demonstrates clear artistic ability, good audience appeal, unique style, good music, etc.)"]
[null,"           5.0 = very good (player demonstrates artistic mastery, very good audience appeal, and/or very good composure "]
[null,null,"and general form, etc.)"]
[null,"           6.0 = perfect (player combines artistic variety, excellent presentation and choreography, and solid"]
[null,null,"general form into an outstanding show)."]
["** TM","           0.0 = extremely poor (player incapable of technical play)"]
[null,"           1.0 = poor (player has some technical ability, but not much)"]
[null,"           2.0 = weak (player can hit some tricks, but lacks much skill)"]
[null,"           3.0 = reasonable (player may not be extremely technical, but has control, does a few tricks very well, etc.)"]
[null,"           4.0 = good (player demonstrates technical ability, good control, different types of tricks, etc.)"]
[null,"           5.0 = very good (player demonstrates technical mastery, wide variety of difficult tricks, and/or very good"]
[null,null,"execution of mastered tricks, etc.)"]
[null,"           6.0 = perfect (player combines variety, difficulty, execution, and form into an outstanding technical routine)."]
[]
["Freestyle Judging Form"]
[]
["Event:",{"$f":"Seeding!$H$5","v":"2012 IFPA U.S. Open Freestyle Championships"},null,null,null,"Date:"]
["Discipline: ",null,null,null,null,"Round:",null,"Pool:","F"]
["Judge:",null,null,null,null,"Certified:   yes  no    (circle whether certified)"]
[]
["Player/Team\n(Full Names)",null,"Drop Count","Trick Count","Avg. Difficulty","Artistic Interpretation (0.0-6.0) *","AI RANK","Technical\nMerit\n(0.0-6.0) * **","TM RANK"]
[{"$f":"IF(Scoring!A57<>\"\",Scoring!A57,\"\")","v":""}]
[{"$f":"IF(Scoring!A58<>\"\",Scoring!A58,\"\")","v":""}]
[{"$f":"IF(Scoring!A59<>\"\",Scoring!A59,\"\")","v":""}]
[{"$f":"IF(Scoring!A60<>\"\",Scoring!A60,\"\")","v":""}]
[{"$f":"IF(Scoring!A61<>\"\",Scoring!A61,\"\")","v":""}]
[{"$f":"IF(Scoring!A62<>\"\",Scoring!A62,\"\")","v":""}]
[{"$f":"IF(Scoring!A63<>\"\",Scoring!A63,\"\")","v":""}]
[{"$f":"IF(Scoring!A64<>\"\",Scoring!A64,\"\")","v":""}]
[{"$f":"IF(Scoring!A65<>\"\",Scoring!A65,\"\")","v":""}]
[{"$f":"IF(Scoring!A66<>\"\",Scoring!A66,\"\")","v":""}]
[]
[]
["* AI","           0.0 = extremely poor (player incapable of artistry)"]
[null,"           1.0 = poor (player has some artistic ability, but not much)"]
[null,"           2.0 = weak (player is attempting performance, but lacks much skill)"]
[null,"           3.0 = reasonable (player may not be extremely artistic, but has routine, focusses on audience, etc.)"]
[null,"           4.0 = good (player demonstrates clear artistic ability, good audience appeal, unique style, good music, etc.)"]
[null,"           5.0 = very good (player demonstrates artistic mastery, very good audience appeal, and/or very good composure "]
[null,null,"and general form, etc.)"]
[null,"           6.0 = perfect (player combines artistic variety, excellent presentation and choreography, and solid"]
[null,null,"general form into an outstanding show)."]
["** TM","           0.0 = extremely poor (player incapable of technical play)"]
[null,"           1.0 = poor (player has some technical ability, but not much)"]
[null,"           2.0 = weak (player can hit some tricks, but lacks much skill)"]
[null,"           3.0 = reasonable (player may not be extremely technical, but has control, does a few tricks very well, etc.)"]
[null,"           4.0 = good (player demonstrates technical ability, good control, different types of tricks, etc.)"]
[null,"           5.0 = very good (player demonstrates technical mastery, wide variety of difficult tricks, and/or very good"]
[null,null,"execution of mastered tricks, etc.)"]
[null,"           6.0 = perfect (player combines variety, difficulty, execution, and form into an outstanding technical routine)."]
[]
["Freestyle Judging Form"]
[]
["Event:",{"$f":"Seeding!$H$5","v":"2012 IFPA U.S. Open Freestyle Championships"},null,null,null,"Date:"]
["Discipline: ",null,null,null,null,"Round:",null,"Pool:","G"]
["Judge:",null,null,null,null,"Certified:   yes  no    (circle whether certified)"]
[]
["Player/Team\n(Full Names)",null,"Drop Count","Trick Count","Avg. Difficulty","Artistic Interpretation (0.0-6.0) *","AI RANK","Technical\nMerit\n(0.0-6.0) * **","TM RANK"]
[{"$f":"IF(Scoring!A68<>\"\",Scoring!A68,\"\")","v":""}]
[{"$f":"IF(Scoring!A69<>\"\",Scoring!A69,\"\")","v":""}]
[{"$f":"IF(Scoring!A70<>\"\",Scoring!A70,\"\")","v":""}]
[{"$f":"IF(Scoring!A71<>\"\",Scoring!A71,\"\")","v":""}]
[{"$f":"IF(Scoring!A72<>\"\",Scoring!A72,\"\")","v":""}]
[{"$f":"IF(Scoring!A73<>\"\",Scoring!A73,\"\")","v":""}]
[{"$f":"IF(Scoring!A74<>\"\",Scoring!A74,\"\")","v":""}]
[{"$f":"IF(Scoring!A75<>\"\",Scoring!A75,\"\")","v":""}]
[{"$f":"IF(Scoring!A76<>\"\",Scoring!A76,\"\")","v":""}]
[{"$f":"IF(Scoring!A77<>\"\",Scoring!A77,\"\")","v":""}]
[]
[]
["* AI","           0.0 = extremely poor (player incapable of artistry)"]
[null,"           1.0 = poor (player has some artistic ability, but not much)"]
[null,"           2.0 = weak (player is attempting performance, but lacks much skill)"]
[null,"           3.0 = reasonable (player may not be extremely artistic, but has routine, focusses on audience, etc.)"]
[null,"           4.0 = good (player demonstrates clear artistic ability, good audience appeal, unique style, good music, etc.)"]
[null,"           5.0 = very good (player demonstrates artistic mastery, very good audience appeal, and/or very good composure "]
[null,null,"and general form, etc.)"]
[null,"           6.0 = perfect (player combines artistic variety, excellent presentation and choreography, and solid"]
[null,null,"general form into an outstanding show)."]
["** TM","           0.0 = extremely poor (player incapable of technical play)"]
[null,"           1.0 = poor (player has some technical ability, but not much)"]
[null,"           2.0 = weak (player can hit some tricks, but lacks much skill)"]
[null,"           3.0 = reasonable (player may not be extremely technical, but has control, does a few tricks very well, etc.)"]
[null,"           4.0 = good (player demonstrates technical ability, good control, different types of tricks, etc.)"]
[null,"           5.0 = very good (player demonstrates technical mastery, wide variety of difficult tricks, and/or very good"]
[null,null,"execution of mastered tricks, etc.)"]
[null,"           6.0 = perfect (player combines variety, difficulty, execution, and form into an outstanding technical routine)."]
[]
["Freestyle Judging Form"]
[]
["Event:",{"$f":"Seeding!$H$5","v":"2012 IFPA U.S. Open Freestyle Championships"},null,null,null,"Date:"]
["Discipline: ",null,null,null,null,"Round:",null,"Pool:","H"]
["Judge:",null,null,null,null,"Certified:   yes  no    (circle whether certified)"]
[]
["Player/Team\n(Full Names)",null,"Drop Count","Trick Count","Avg. Difficulty","Artistic Interpretation (0.0-6.0) *","AI RANK","Technical\nMerit\n(0.0-6.0) * **","TM RANK"]
[{"$f":"IF(Scoring!A79<>\"\",Scoring!A79,\"\")","v":""}]
[{"$f":"IF(Scoring!A80<>\"\",Scoring!A80,\"\")","v":""}]
[{"$f":"IF(Scoring!A81<>\"\",Scoring!A81,\"\")","v":""}]
[{"$f":"IF(Scoring!A82<>\"\",Scoring!A82,\"\")","v":""}]
[{"$f":"IF(Scoring!A83<>\"\",Scoring!A83,\"\")","v":""}]
[{"$f":"IF(Scoring!A84<>\"\",Scoring!A84,\"\")","v":""}]
[{"$f":"IF(Scoring!A85<>\"\",Scoring!A85,\"\")","v":""}]
[{"$f":"IF(Scoring!A86<>\"\",Scoring!A86,\"\")","v":""}]
[{"$f":"IF(Scoring!A87<>\"\",Scoring!A87,\"\")","v":""}]
[{"$f":"IF(Scoring!A88<>\"\",Scoring!A88,\"\")","v":""}]
[]
[]
["* AI","           0.0 = extremely poor (player incapable of artistry)"]
[null,"           1.0 = poor (player has some artistic ability, but not much)"]
[null,"           2.0 = weak (player is attempting performance, but lacks much skill)"]
[null,"           3.0 = reasonable (player may not be extremely artistic, but has routine, focusses on audience, etc.)"]
[null,"           4.0 = good (player demonstrates clear artistic ability, good audience appeal, unique style, good music, etc.)"]
[null,"           5.0 = very good (player demonstrates artistic mastery, very good audience appeal, and/or very good composure "]
[null,null,"and general form, etc.)"]
[null,"           6.0 = perfect (player combines artistic variety, excellent presentation and choreography, and solid"]
[null,null,"general form into an outstanding show)."]
["** TM","           0.0 = extremely poor (player incapable of technical play)"]
[null,"           1.0 = poor (player has some technical ability, but not much)"]
[null,"           2.0 = weak (player can hit some tricks, but lacks much skill)"]
[null,"           3.0 = reasonable (player may not be extremely technical, but has control, does a few tricks very well, etc.)"]
[null,"           4.0 = good (player demonstrates technical ability, good control, different types of tricks, etc.)"]
[null,"           5.0 = very good (player demonstrates technical mastery, wide variety of difficult tricks, and/or very good"]
[null,null,"execution of mastered tricks, etc.)"]
[null,"           6.0 = perfect (player combines variety, difficulty, execution, and form into an outstanding technical routine)."]

{"sheet":"Scoring","index":3,"n_rows":88,"n_cols":46,"rows_kept":88,"cut":false,"hidden":false,"merged":[[12,30,12,31]]}
["Pool A","A1","T1","A2","T2","A3","T3","A4","T4","A5","T5","A6","T6","AA1","AT1","AA2","AT2","AA3","AT3","AA4","AT4","AA5","AT5","AA6","AT6",null,"Atot","Ttot","Tot","Rnk",null,null,"NA1","NT1","NA2","NT2","NA3","NT3","NA4","NT4","NA5","NT5","NA6","NT6","TotN","RankN"]
[null,null,null,null,null,null,null,null,null,null,null,null,null,{"$f":"IF(B2<>0,RANK(B2,B$2:B$11),0)","v":0},{"$f":"IF(C2<>0,RANK(C2,C$2:C$11),0)","v":0},{"$f":"IF(D2<>0,RANK(D2,D$2:D$11),0)","v":0},{"$f":"IF(E2<>0,RANK(E2,E$2:E$11),0)","v":0},{"$f":"IF(F2<>0,RANK(F2,F$2:F$11),0)","v":0},{"$f":"IF(G2<>0,RANK(G2,G$2:G$11),0)","v":0},{"$f":"IF(H2<>0,RANK(H2,H$2:H$11),0)","v":0},{"$f":"IF(I2<>0,RANK(I2,I$2:I$11),0)","v":0},{"$f":"IF(J2<>0,RANK(J2,J$2:J$11),0)","v":0},{"$f":"IF(K2<>0,RANK(K2,K$2:K$11),0)","v":0},{"$f":"IF(L2<>0,RANK(L2,L$2:L$11),0)","v":0},{"$f":"IF(M2<>0,RANK(M2,M$2:M$11),0)","v":0},null,{"$f":"N2+P2+R2+T2+V2+X2","v":0},{"$f":"O2+Q2+S2+U2+W2+Y2","v":0},{"$f":"AA2+AB2","v":0},{"$f":"IF(AC2<>0,RANK(AC2,AC$2:AC$11,1)-10+COUNT(B$2:B$11),CHAR(32))","v":" "},null,null,{"$f":"IF(B2<>0,NORMDIST(B2,AVERAGE(B$2:B$11),STDEV(B$2:B$11),TRUE),CHAR(32))","v":" "},{"$f":"IF(C2<>0,NORMDIST(C2,AVERAGE(C$2:C$11),STDEV(C$2:C$11),TRUE),CHAR(32))","v":" "},{"$f":"IF(D2<>0,NORMDIST(D2,AVERAGE(D$2:D$11),STDEV(D$2:D$11),TRUE),CHAR(32))","v":" "},{"$f":"IF(E2<>0,NORMDIST(E2,AVERAGE(E$2:E$11),STDEV(E$2:E$11),TRUE),CHAR(32))","v":" "},{"$f":"IF(F2<>0,NORMDIST(F2,AVERAGE(F$2:F$11),STDEV(F$2:F$11),TRUE),CHAR(32))","v":" "},{"$f":"IF(G2<>0,NORMDIST(G2,AVERAGE(G$2:G$11),STDEV(G$2:G$11),TRUE),CHAR(32))","v":" "},{"$f":"IF(H2<>0,NORMDIST(H2,AVERAGE(H$2:H$11),STDEV(H$2:H$11),TRUE),CHAR(32))","v":" "},{"$f":"IF(I2<>0,NORMDIST(I2,AVERAGE(I$2:I$11),STDEV(I$2:I$11),TRUE),CHAR(32))","v":" "},{"$f":"IF(J2<>0,NORMDIST(J2,AVERAGE(J$2:J$11),STDEV(J$2:J$11),TRUE),CHAR(32))","v":" "},{"$f":"IF(K2<>0,NORMDIST(K2,AVERAGE(K$2:K$11),STDEV(K$2:K$11),TRUE),CHAR(32))","v":" "},{"$f":"IF(L2<>0,NORMDIST(L2,AVERAGE(L$2:L$11),STDEV(L$2:L$11),TRUE),CHAR(32))","v":" "},{"$f":"IF(M2<>0,NORMDIST(M2,AVERAGE(M$2:M$11),STDEV(M$2:M$11),TRUE),CHAR(32))","v":" "},{"$f":"IF(SUM(AG2:AR2)> 0,SUM(AG2:AR2), CHAR(32))","v":" "},{"$f":"IF(AS2 <> CHAR(32), RANK(AS2, AS$2:AS$11), CHAR(32))","v":" "}]
[null,null,null,null,null,null,null,null,null,null,null,null,null,0,0,0,0,0,0,0,0,0,0,0,0,null,0,0,{"$f":"AA3+AB3","v":0}," ",null,null," "," "," "," "," "," "," "," "," "," "," "," ",{"$f":"IF(SUM(AG3:AR3)> 0,SUM(AG3:AR3), CHAR(32))","v":" "},{"$f":"IF(AS3 <> CHAR(32), RANK(AS3, AS$2:AS$11), CHAR(32))","v":" "}]
[null,null,null,null,null,null,null,null,null,null,null,null,null,0,0,0,0,0,0,0,0,0,0,0,0,null,0,0,{"$f":"AA4+AB4","v":0}," ",null,null," "," "," "," "," "," "," "," "," "," "," "," ",{"$f":"IF(SUM(AG4:AR4)> 0,SUM(AG4:AR4), CHAR(32))","v":" "}," "]
[null,null,null,null,null,null,null,null,null,null,null,null,null,0,0,0,0,0,0,0,0,0,0,0,0,null,0,0,0," ",null,null," "," "," "," "," "," "," "," "," "," "," "," "," "," "]
[null,null,null,null,null,null,null,null,null,null,null,null,null,0,0,0,0,0,0,0,0,0,0,0,0,null,0,0,0," ",null,null," "," "," "," "," "," "," "," "," "," "," "," "," "," "]
["Player 10",null,null,null,null,null,null,null,null,null,null,null,null,0,0,0,0,0,0,0,0,0,0,0,0,null,0,0,0," ",null,null," "," "," "," "," "," "," "," "," "," "," "," "," "," "]
["Player 7",null,null,null,null,null,null,null,null,null,null,null,null,0,0,0,0,0,0,0,0,0,0,0,0,null,0,0,0," ",null,null," "," "," "," "," "," "," "," "," "," "," "," "," "," "]
["Player 6",null,null,null,null,null,null,null,null,null,null,null,null,0,0,0,0,0,0,0,0,0,0,0,0,null,0,0,0," ",null,null," "," "," "," "," "," "," "," "," "," "," "," "," "," "]
["Player 3",null,null,null,null,null,null,null,null,null,null,null,null,0,0,0,0,0,0,0,0,0,0,0,0,null,0,0,0," ",null,null," "," "," "," "," "," "," "," "," "," "," "," "," "," "]
["Player 2",null,null,null,null,null,null,null,null,null,null,null,null,0,0,0,0,0,0,0,0,0,0,0,0,null,0,0,0," ",null,null," "," "," "," "," "," "," "," "," "," "," "," "," "," "]
["Pool B","A1","T1","A2","T2","A3","T3","A4","T4","A5","T5","A6","T6","AA1","AT1","AA2","AT2","AA3","AT3","AA4","AT4","AA5","AT5","AA6","AT6",null,"Atot","Ttot","Tot","Rnk"]
[null,null,null,null,null,null,null,null,null,null,null,null,null,{"$f":"IF(B13<>0,RANK(B13,B$13:B$22),0)","v":0},{"$f":"IF(C13<>0,RANK(C13,C$13:C$22),0)","v":0},{"$f":"IF(D13<>0,RANK(D13,D$13:D$22),0)","v":0},{"$f":"IF(E13<>0,RANK(E13,E$13:E$22),0)","v":0},{"$f":"IF(F13<>0,RANK(F13,F$13:F$22),0)","v":0},{"$f":"IF(G13<>0,RANK(G13,G$13:G$22),0)","v":0},{"$f":"IF(H13<>0,RANK(H13,H$13:H$22),0)","v":0},{"$f":"IF(I13<>0,RANK(I13,I$13:I$22),0)","v":0},{"$f":"IF(J13<>0,RANK(J13,J$13:J$22),0)","v":0},{"$f":"IF(K13<>0,RANK(K13,K$13:K$22),0)","v":0},{"$f":"IF(L13<>0,RANK(L13,L$13:L$22),0)","v":0},{"$f":"IF(M13<>0,RANK(M13,M$13:M$22),0)","v":0},null,{"$f":"N13+P13+R13+T13+V13+X13","v":0},{"$f":"O13+Q13+S13+U13+W13+Y13","v":0},{"$f":"AA13+AB13","v":0},{"$f":"IF(AC13<>0,RANK(AC13,AC$13:AC$22,1)-10+COUNT(B$13:B$22),CHAR(32))","v":" "},"DO NOT PUSH!",null,{"$f":"IF(B13<>0,NORMDIST(B13,AVERAGE(B$13:B$22),STDEV(B$13:B$22),TRUE),CHAR(32))","v":" "},{"$f":"IF(C13<>0,NORMDIST(C13,AVERAGE(C$13:C$22),STDEV(C$13:C$22),TRUE),CHAR(32))","v":" "}," "," "," "," "," "," "," "," "," "," "," ",{"$f":"IF(AS13 <> CHAR(32), RANK(AS13, AS$13:AS$22), CHAR(32))","v":" "}]
[null,null,null,null,null,null,null,null,null,null,null,null,null,0,0,0,0,0,0,0,0,0,0,0,0,null,0,0,{"$f":"AA14+AB14","v":0}," ",null,null,{"$f":"IF(B14<>0,NORMDIST(B14,AVERAGE(B$13:B$22),STDEV(B$13:B$22),TRUE),CHAR(32))","v":" "},{"$f":"IF(C14<>0,NORMDIST(C14,AVERAGE(C$13:C$22),STDEV(C$13:C$22),TRUE),CHAR(32))","v":" "},{"$f":"IF(D14<>0,NORMDIST(D14,AVERAGE(D$13:D$22),STDEV(D$13:D$22),TRUE),CHAR(32))","v":" "},{"$f":"IF(E14<>0,NORMDIST(E14,AVERAGE(E$13:E$22),STDEV(E$13:E$22),TRUE),CHAR(32))","v":" "},{"$f":"IF(F14<>0,NORMDIST(F14,AVERAGE(F$13:F$22),STDEV(F$13:F$22),TRUE),CHAR(32))","v":" "},{"$f":"IF(G14<>0,NORMDIST(G14,AVERAGE(G$13:G$22),STDEV(G$13:G$22),TRUE),CHAR(32))","v":" "},{"$f":"IF(H14<>0,NORMDIST(H14,AVERAGE(H$13:H$22),STDEV(H$13:H$22),TRUE),CHAR(32))","v":" "},{"$f":"IF(I14<>0,NORMDIST(I14,AVERAGE(I$13:I$22),STDEV(I$13:I$22),TRUE),CHAR(32))","v":" "},{"$f":"IF(J14<>0,NORMDIST(J14,AVERAGE(J$13:J$22),STDEV(J$13:J$22),TRUE),CHAR(32))","v":" "},{"$f":"IF(K14<>0,NORMDIST(K14,AVERAGE(K$13:K$22),STDEV(K$13:K$22),TRUE),CHAR(32))","v":" "},{"$f":"IF(L14<>0,NORMDIST(L14,AVERAGE(L$13:L$22),STDEV(L$13:L$22),TRUE),CHAR(32))","v":" "},{"$f":"IF(M14<>0,NORMDIST(M14,AVERAGE(M$13:M$22),STDEV(M$13:M$22),TRUE),CHAR(32))","v":" "}," ",{"$f":"IF(AS14 <> CHAR(32), RANK(AS14, AS$13:AS$22), CHAR(32))","v":" "}]
[null,null,null,null,null,null,null,null,null,null,null,null,null,0,0,0,0,0,0,0,0,0,0,0,0,null,0,0,0," ",null,null,{"$f":"IF(B15<>0,NORMDIST(B15,AVERAGE(B$13:B$22),STDEV(B$13:B$22),TRUE),CHAR(32))","v":" "}," "," "," "," "," "," "," "," "," "," "," "," "," "]
[null,null,null,null,null,null,null,null,null,null,null,null,null,0,0,0,0,0,0,0,0,0,0,0,0,null,0,0,0," ",null,null," "," "," "," "," "," "," "," "," "," "," "," "," "," "]
[null,null,null,null,null,null,null,null,null,null,null,null,null,0,0,0,0,0,0,0,0,0,0,0,0,null,0,0,0," ",null,null," "," "," "," "," "," "," "," "," "," "," "," "," "," "]
["Player 9",null,null,null,null,null,null,null,null,null,null,null,null,0,0,0,0,0,0,0,0,0,0,0,0,null,0,0,0," ",null,null," "," "," "," "," "," "," "," "," "," "," "," "," "," "]
["Player 8",null,null,null,null,null,null,null,null,null,null,null,null,0,0,0,0,0,0,0,0,0,0,0,0,null,0,0,0," ",null,null," "," "," "," "," "," "," "," "," "," "," "," "," "," "]
["Player 5",null,null,null,null,null,null,null,null,null,null,null,null,0,0,0,0,0,0,0,0,0,0,0,0,null,0,0,0," ",null,null," "," "," "," "," "," "," "," "," "," "," "," "," "," "]
["Player 4",null,null,null,null,null,null,null,null,null,null,null,null,0,0,0,0,0,0,0,0,0,0,0,0,null,0,0,0," ",null,null," "," "," "," "," "," "," "," "," "," "," "," "," "," "]
["Player 1",null,null,null,null,null,null,null,null,null,null,null,null,0,0,0,0,0,0,0,0,0,0,0,0,null,0,0,0," ",null,null," "," "," "," "," "," "," "," "," "," "," "," "," "," "]
["Pool C","A1","T1","A2","T2","A3","T3","A4","T4","A5","T5","A6","T6","AA1","AT1","AA2","AT2","AA3","AT3","AA4","AT4","AA5","AT5","AA6","AT6",null,"Atot","Ttot","Tot","Rnk"]
[null,null,null,null,null,null,null,null,null,null,null,null,null,{"$f":"IF(B24<>0,RANK(B24,B$24:B$33),0)","v":0},{"$f":"IF(C24<>0,RANK(C24,C$24:C$33),0)","v":0},{"$f":"IF(D24<>0,RANK(D24,D$24:D$33),0)","v":0},{"$f":"IF(E24<>0,RANK(E24,E$24:E$33),0)","v":0},{"$f":"IF(F24<>0,RANK(F24,F$24:F$33),0)","v":0},{"$f":"IF(G24<>0,RANK(G24,G$24:G$33),0)","v":0},{"$f":"IF(H24<>0,RANK(H24,H$24:H$33),0)","v":0},{"$f":"IF(I24<>0,RANK(I24,I$24:I$33),0)","v":0},{"$f":"IF(J24<>0,RANK(J24,J$24:J$33),0)","v":0},{"$f":"IF(K24<>0,RANK(K24,K$24:K$33),0)","v":0},{"$f":"IF(L24<>0,RANK(L24,L$24:L$33),0)","v":0},{"$f":"IF(M24<>0,RANK(M24,M$24:M$33),0)","v":0},null,{"$f":"N24+P24+R24+T24+V24+X24","v":0},{"$f":"O24+Q24+S24+U24+W24+Y24","v":0},{"$f":"AA24+AB24","v":0},{"$f":"IF(AC24<>0,RANK(AC24,AC$24:AC$33,1)-10+COUNT(B$24:B$33),CHAR(32))","v":" "},null,null,{"$f":"IF(B24<>0,NORMDIST(B24,AVERAGE(B$24:B$33),STDEV(B$24:B$33),TRUE),CHAR(32))","v":" "},{"$f":"IF(C24<>0,NORMDIST(C24,AVERAGE(C$24:C$33),STDEV(C$24:C$33),TRUE),CHAR(32))","v":" "}," "," "," "," "," "," "," "," "," "," "," ",{"$f":"IF(AS24 <> CHAR(32), RANK(AS24, AS$24:AS$33), CHAR(32))","v":" "}]
[null,null,null,null,null,null,null,null,null,null,null,null,null,0,0,0,0,0,0,0,0,0,0,0,0,null,0,0,{"$f":"AA25+AB25","v":0}," ",null,null,{"$f":"IF(B25<>0,NORMDIST(B25,AVERAGE(B$24:B$33),STDEV(B$24:B$33),TRUE),CHAR(32))","v":" "}," "," "," "," "," "," "," "," "," "," "," "," ",{"$f":"IF(AS25 <> CHAR(32), RANK(AS25, AS$24:AS$33), CHAR(32))","v":" "}]
[null,null,null,null,null,null,null,null,null,null,null,null,null,0,0,0,0,0,0,0,0,0,0,0,0,null,0,0,0," ",null,null,{"$f":"IF(B26<>0,NORMDIST(B26,AVERAGE(B$24:B$33),STDEV(B$24:B$33),TRUE),CHAR(32))","v":" "}," "," "," "," "," "," "," "," "," "," "," "," "," "]
[null,null,null,null,null,null,null,null,null,null,null,null,null,0,0,0,0,0,0,0,0,0,0,0,0,null,0,0,0," ",null,null," "," "," "," "," "," "," "," "," "," "," "," "," "," "]
[null,null,null,null,null,null,null,null,null,null,null,null,null,0,0,0,0,0,0,0,0,0,0,0,0,null,0,0,0," ",null,null," "," "," "," "," "," "," "," "," "," "," "," "," "," "]
[null,null,null,null,null,null,null,null,null,null,null,null,null,0,0,0,0,0,0,0,0,0,0,0,0,null,0,0,0," ",null,null," "," "," "," "," "," "," "," "," "," "," "," "," "," "]
[null,null,null,null,null,null,null,null,null,null,null,null,null,0,0,0,0,0,0,0,0,0,0,0,0,null,0,0,0," ",null,null," "," "," "," "," "," "," "," "," "," "," "," "," "," "]
[null,null,null,null,null,null,null,null,null,null,null,null,null,0,0,0,0,0,0,0,0,0,0,0,0,null,0,0,0," ",null,null," "," "," "," "," "," "," "," "," "," "," "," "," "," "]
[null,null,null,null,null,null,null,null,null,null,null,null,null,0,0,0,0,0,0,0,0,0,0,0,0,null,0,0,0," ",null,null," "," "," "," "," "," "," "," "," "," "," "," "," "," "]
[null,null,null,null,null,null,null,null,null,null,null,null,null,0,0,0,0,0,0,0,0,0,0,0,0,null,0,0,0," ",null,null," "," "," "," "," "," "," "," "," "," "," "," "," "," "]
["Pool D","A1","T1","A2","T2","A3","T3","A4","T4","A5","T5","A6","T6","AA1","AT1","AA2","AT2","AA3","AT3","AA4","AT4","AA5","AT5","AA6","AT6",null,"Atot","Ttot","Tot","Rnk"]
[null,null,null,null,null,null,null,null,null,null,null,null,null,{"$f":"IF(B35<>0,RANK(B35,B$35:B$44),0)","v":0},{"$f":"IF(C35<>0,RANK(C35,C$35:C$44),0)","v":0},{"$f":"IF(D35<>0,RANK(D35,D$35:D$44),0)","v":0},{"$f":"IF(E35<>0,RANK(E35,E$35:E$44),0)","v":0},{"$f":"IF(F35<>0,RANK(F35,F$35:F$44),0)","v":0},{"$f":"IF(G35<>0,RANK(G35,G$35:G$44),0)","v":0},{"$f":"IF(H35<>0,RANK(H35,H$35:H$44),0)","v":0},{"$f":"IF(I35<>0,RANK(I35,I$35:I$44),0)","v":0},{"$f":"IF(J35<>0,RANK(J35,J$35:J$44),0)","v":0},{"$f":"IF(K35<>0,RANK(K35,K$35:K$44),0)","v":0},{"$f":"IF(L35<>0,RANK(L35,L$35:L$44),0)","v":0},{"$f":"IF(M35<>0,RANK(M35,M$35:M$44),0)","v":0},null,{"$f":"N35+P35+R35+T35+V35+X35","v":0},{"$f":"O35+Q35+S35+U35+W35+Y35","v":0},{"$f":"AA35+AB35","v":0},{"$f":"IF(AC35<>0,RANK(AC35,AC$35:AC$44,1)-10+COUNT(B$35:B$44),CHAR(32))","v":" "},null,null,{"$f":"IF(B35<>0,NORMDIST(B35,AVERAGE(B$35:B$44),STDEV(B$35:B$44),TRUE),CHAR(32))","v":" "},{"$f":"IF(C35<>0,NORMDIST(C35,AVERAGE(C$35:C$44),STDEV(C$35:C$44),TRUE),CHAR(32))","v":" "},{"$f":"IF(D35<>0,NORMDIST(D35,AVERAGE(D$35:D$44),STDEV(D$35:D$44),TRUE),CHAR(32))","v":" "},{"$f":"IF(E35<>0,NORMDIST(E35,AVERAGE(E$35:E$44),STDEV(E$35:E$44),TRUE),CHAR(32))","v":" "},{"$f":"IF(F35<>0,NORMDIST(F35,AVERAGE(F$35:F$44),STDEV(F$35:F$44),TRUE),CHAR(32))","v":" "},{"$f":"IF(G35<>0,NORMDIST(G35,AVERAGE(G$35:G$44),STDEV(G$35:G$44),TRUE),CHAR(32))","v":" "},{"$f":"IF(H35<>0,NORMDIST(H35,AVERAGE(H$35:H$44),STDEV(H$35:H$44),TRUE),CHAR(32))","v":" "},{"$f":"IF(I35<>0,NORMDIST(I35,AVERAGE(I$35:I$44),STDEV(I$35:I$44),TRUE),CHAR(32))","v":" "},{"$f":"IF(J35<>0,NORMDIST(J35,AVERAGE(J$35:J$44),STDEV(J$35:J$44),TRUE),CHAR(32))","v":" "},{"$f":"IF(K35<>0,NORMDIST(K35,AVERAGE(K$35:K$44),STDEV(K$35:K$44),TRUE),CHAR(32))","v":" "},{"$f":"IF(L35<>0,NORMDIST(L35,AVERAGE(L$35:L$44),STDEV(L$35:L$44),TRUE),CHAR(32))","v":" "},{"$f":"IF(M35<>0,NORMDIST(M35,AVERAGE(M$35:M$44),STDEV(M$35:M$44),TRUE),CHAR(32))","v":" "}," ",{"$f":"IF(AS35 <> CHAR(32), RANK(AS35, AS$35:AS$44), CHAR(32))","v":" "}]
[null,null,null,null,null,null,null,null,null,null,null,null,null,0,0,0,0,0,0,0,0,0,0,0,0,null,0,0,{"$f":"AA36+AB36","v":0}," ",null,null,{"$f":"IF(B36<>0,NORMDIST(B36,AVERAGE(B$35:B$44),STDEV(B$35:B$44),TRUE),CHAR(32))","v":" "}," "," "," "," "," "," "," "," "," "," "," "," ",{"$f":"IF(AS36 <> CHAR(32), RANK(AS36, AS$35:AS$44), CHAR(32))","v":" "}]
[null,null,null,null,null,null,null,null,null,null,null,null,null,0,0,0,0,0,0,0,0,0,0,0,0,null,0,0,0," ",null,null,{"$f":"IF(B37<>0,NORMDIST(B37,AVERAGE(B$35:B$44),STDEV(B$35:B$44),TRUE),CHAR(32))","v":" "}," "," "," "," "," "," "," "," "," "," "," "," "," "]
[null,null,null,null,null,null,null,null,null,null,null,null,null,0,0,0,0,0,0,0,0,0,0,0,0,null,0,0,0," ",null,null,{"$f":"IF(B38<>0,NORMDIST(B38,AVERAGE(B$35:B$44),STDEV(B$35:B$44),TRUE),CHAR(32))","v":" "}," "," "," "," "," "," "," "," "," "," "," "," "," "]
[null,null,null,null,null,null,null,null,null,null,null,null,null,0,0,0,0,0,0,0,0,0,0,0,0,null,0,0,0," ",null,null," "," "," "," "," "," "," "," "," "," "," "," "," "," "]
[null,null,null,null,null,null,null,null,null,null,null,null,null,0,0,0,0,0,0,0,0,0,0,0,0,null,0,0,0," ",null,null," "," "," "," "," "," "," "," "," "," "," "," "," "," "]
[null,null,null,null,null,null,null,null,null,null,null,null,null,0,0,0,0,0,0,0,0,0,0,0,0,null,0,0,0," ",null,null," "," "," "," "," "," "," "," "," "," "," "," "," "," "]
[null,null,null,null,null,null,null,null,null,null,null,null,null,0,0,0,0,0,0,0,0,0,0,0,0,null,0,0,0," ",null,null," "," "," "," "," "," "," "," "," "," "," "," "," "," "]
[null,null,null,null,null,null,null,null,null,null,null,null,null,0,0,0,0,0,0,0,0,0,0,0,0,null,0,0,0," ",null,null," "," "," "," "," "," "," "," "," "," "," "," "," "," "]
[null,null,null,null,null,null,null,null,null,null,null,null,null,0,0,0,0,0,0,0,0,0,0,0,0,null,0,0,0," ",null,null," "," "," "," "," "," "," "," "," "," "," "," "," "," "]
["Pool E","A1","T1","A2","T2","A3","T3","A4","T4","A5","T5","A6","T6","AA1","AT1","AA2","AT2","AA3","AT3","AA4","AT4","AA5","AT5","AA6","AT6",null,"Atot","Ttot","Tot","Rnk"]
[null,null,null,null,null,null,null,null,null,null,null,null,null,{"$f":"IF(B46<>0,RANK(B46,B$46:B$55),0)","v":0},{"$f":"IF(C46<>0,RANK(C46,C$46:C$55),0)","v":0},{"$f":"IF(D46<>0,RANK(D46,D$46:D$55),0)","v":0},{"$f":"IF(E46<>0,RANK(E46,E$46:E$55),0)","v":0},{"$f":"IF(F46<>0,RANK(F46,F$46:F$55),0)","v":0},{"$f":"IF(G46<>0,RANK(G46,G$46:G$55),0)","v":0},{"$f":"IF(H46<>0,RANK(H46,H$46:H$55),0)","v":0},{"$f":"IF(I46<>0,RANK(I46,I$46:I$55),0)","v":0},{"$f":"IF(J46<>0,RANK(J46,J$46:J$55),0)","v":0},{"$f":"IF(K46<>0,RANK(K46,K$46:K$55),0)","v":0},{"$f":"IF(L46<>0,RANK(L46,L$46:L$55),0)","v":0},{"$f":"IF(M46<>0,RANK(M46,M$46:M$55),0)","v":0},null,{"$f":"N46+P46+R46+T46+V46+X46","v":0},{"$f":"O46+Q46+S46+U46+W46+Y46","v":0},{"$f":"AA46+AB46","v":0},{"$f":"IF(AC46<>0,RANK(AC46,AC$46:AC$55,1)-10+COUNT(B$46:B$55),CHAR(32))","v":" "},null,null,{"$f":"IF(B46<>0,NORMDIST(B46,AVERAGE(B$46:B$55),STDEV(B$46:B$55),TRUE),CHAR(32))","v":" "},{"$f":"IF(C46<>0,NORMDIST(C46,AVERAGE(C$46:C$55),STDEV(C$46:C$55),TRUE),CHAR(32))","v":" "},{"$f":"IF(D46<>0,NORMDIST(D46,AVERAGE(D$46:D$55),STDEV(D$46:D$55),TRUE),CHAR(32))","v":" "},{"$f":"IF(E46<>0,NORMDIST(E46,AVERAGE(E$46:E$55),STDEV(E$46:E$55),TRUE),CHAR(32))","v":" "},{"$f":"IF(F46<>0,NORMDIST(F46,AVERAGE(F$46:F$55),STDEV(F$46:F$55),TRUE),CHAR(32))","v":" "},{"$f":"IF(G46<>0,NORMDIST(G46,AVERAGE(G$46:G$55),STDEV(G$46:G$55),TRUE),CHAR(32))","v":" "},{"$f":"IF(H46<>0,NORMDIST(H46,AVERAGE(H$46:H$55),STDEV(H$46:H$55),TRUE),CHAR(32))","v":" "},{"$f":"IF(I46<>0,NORMDIST(I46,AVERAGE(I$46:I$55),STDEV(I$46:I$55),TRUE),CHAR(32))","v":" "},{"$f":"IF(J46<>0,NORMDIST(J46,AVERAGE(J$46:J$55),STDEV(J$46:J$55),TRUE),CHAR(32))","v":" "},{"$f":"IF(K46<>0,NORMDIST(K46,AVERAGE(K$46:K$55),STDEV(K$46:K$55),TRUE),CHAR(32))","v":" "},{"$f":"IF(L46<>0,NORMDIST(L46,AVERAGE(L$46:L$55),STDEV(L$46:L$55),TRUE),CHAR(32))","v":" "},{"$f":"IF(M46<>0,NORMDIST(M46,AVERAGE(M$46:M$55),STDEV(M$46:M$55),TRUE),CHAR(32))","v":" "}," ",{"$f":"IF(AS46 <> CHAR(32), RANK(AS46, AS$46:AS$55), CHAR(32))","v":" "}]
[null,null,null,null,null,null,null,null,null,null,null,null,null,0,0,0,0,0,0,0,0,0,0,0,0,null,0,0,{"$f":"AA47+AB47","v":0}," ",null,null,{"$f":"IF(B47<>0,NORMDIST(B47,AVERAGE(B$46:B$55),STDEV(B$46:B$55),TRUE),CHAR(32))","v":" "}," "," "," "," "," "," "," "," "," "," "," "," ",{"$f":"IF(AS47 <> CHAR(32), RANK(AS47, AS$46:AS$55), CHAR(32))","v":" "}]
[null,null,null,null,null,null,null,null,null,null,null,null,null,0,0,0,0,0,0,0,0,0,0,0,0,null,0,0,0," ",null,null,{"$f":"IF(B48<>0,NORMDIST(B48,AVERAGE(B$46:B$55),STDEV(B$46:B$55),TRUE),CHAR(32))","v":" "}," "," "," "," "," "," "," "," "," "," "," "," "," "]
[null,null,null,null,null,null,null,null,null,null,null,null,null,0,0,0,0,0,0,0,0,0,0,0,0,null,0,0,0," ",null,null," "," "," "," "," "," "," "," "," "," "," "," "," "," "]
[null,null,null,null,null,null,null,null,null,null,null,null,null,0,0,0,0,0,0,0,0,0,0,0,0,null,0,0,0," ",null,null," "," "," "," "," "," "," "," "," "," "," "," "," "," "]
[null,null,null,null,null,null,null,null,null,null,null,null,null,0,0,0,0,0,0,0,0,0,0,0,0,null,0,0,0," ",null,null," "," "," "," "," "," "," "," "," "," "," "," "," "," "]
[null,null,null,null,null,null,null,null,null,null,null,null,null,0,0,0,0,0,0,0,0,0,0,0,0,null,0,0,0," ",null,null," "," "," "," "," "," "," "," "," "," "," "," "," "," "]
[null,null,null,null,null,null,null,null,null,null,null,null,null,0,0,0,0,0,0,0,0,0,0,0,0,null,0,0,0," ",null,null," "," "," "," "," "," "," "," "," "," "," "," "," "," "]
[null,null,null,null,null,null,null,null,null,null,null,null,null,0,0,0,0,0,0,0,0,0,0,0,0,null,0,0,0," ",null,null," "," "," "," "," "," "," "," "," "," "," "," "," "," "]
[null,null,null,null,null,null,null,null,null,null,null,null,null,0,0,0,0,0,0,0,0,0,0,0,0,null,0,0,0," ",null,null," "," "," "," "," "," "," "," "," "," "," "," "," "," "]
["Pool F","A1","T1","A2","T2","A3","T3","A4","T4","A5","T5","A6","T6","AA1","AT1","AA2","AT2","AA3","AT3","AA4","AT4","AA5","AT5","AA6","AT6",null,"Atot","Ttot","Tot","Rnk"]
[null,null,null,null,null,null,null,null,null,null,null,null,null,{"$f":"IF(B57<>0,RANK(B57,B$57:B$66),0)","v":0},{"$f":"IF(C57<>0,RANK(C57,C$57:C$66),0)","v":0},{"$f":"IF(D57<>0,RANK(D57,D$57:D$66),0)","v":0},{"$f":"IF(E57<>0,RANK(E57,E$57:E$66),0)","v":0},{"$f":"IF(F57<>0,RANK(F57,F$57:F$66),0)","v":0},{"$f":"IF(G57<>0,RANK(G57,G$57:G$66),0)","v":0},{"$f":"IF(H57<>0,RANK(H57,H$57:H$66),0)","v":0},{"$f":"IF(I57<>0,RANK(I57,I$57:I$66),0)","v":0},{"$f":"IF(J57<>0,RANK(J57,J$57:J$66),0)","v":0},{"$f":"IF(K57<>0,RANK(K57,K$57:K$66),0)","v":0},{"$f":"IF(L57<>0,RANK(L57,L$57:L$66),0)","v":0},{"$f":"IF(M57<>0,RANK(M57,M$57:M$66),0)","v":0},null,{"$f":"N57+P57+R57+T57+V57+X57","v":0},{"$f":"O57+Q57+S57+U57+W57+Y57","v":0},{"$f":"AA57+AB57","v":0},{"$f":"IF(AC57<>0,RANK(AC57,AC$57:AC$66,1)-10+COUNT(B$57:B$66),CHAR(32))","v":" "},null,null,{"$f":"IF(B57<>0,NORMDIST(B57,AVERAGE(B$57:B$66),STDEV(B$57:B$66),TRUE),CHAR(32))","v":" "},{"$f":"IF(C57<>0,NORMDIST(C57,AVERAGE(C$57:C$66),STDEV(C$57:C$66),TRUE),CHAR(32))","v":" "},{"$f":"IF(D57<>0,NORMDIST(D57,AVERAGE(D$57:D$66),STDEV(D$57:D$66),TRUE),CHAR(32))","v":" "},{"$f":"IF(E57<>0,NORMDIST(E57,AVERAGE(E$57:E$66),STDEV(E$57:E$66),TRUE),CHAR(32))","v":" "},{"$f":"IF(F57<>0,NORMDIST(F57,AVERAGE(F$57:F$66),STDEV(F$57:F$66),TRUE),CHAR(32))","v":" "},{"$f":"IF(G57<>0,NORMDIST(G57,AVERAGE(G$57:G$66),STDEV(G$57:G$66),TRUE),CHAR(32))","v":" "},{"$f":"IF(H57<>0,NORMDIST(H57,AVERAGE(H$57:H$66),STDEV(H$57:H$66),TRUE),CHAR(32))","v":" "},{"$f":"IF(I57<>0,NORMDIST(I57,AVERAGE(I$57:I$66),STDEV(I$57:I$66),TRUE),CHAR(32))","v":" "},{"$f":"IF(J57<>0,NORMDIST(J57,AVERAGE(J$57:J$66),STDEV(J$57:J$66),TRUE),CHAR(32))","v":" "},{"$f":"IF(K57<>0,NORMDIST(K57,AVERAGE(K$57:K$66),STDEV(K$57:K$66),TRUE),CHAR(32))","v":" "},{"$f":"IF(L57<>0,NORMDIST(L57,AVERAGE(L$57:L$66),STDEV(L$57:L$66),TRUE),CHAR(32))","v":" "},{"$f":"IF(M57<>0,NORMDIST(M57,AVERAGE(M$57:M$66),STDEV(M$57:M$66),TRUE),CHAR(32))","v":" "}," ",{"$f":"IF(AS57 <> CHAR(32), RANK(AS57, AS$57:AS$66), CHAR(32))","v":" "}]
[null,null,null,null,null,null,null,null,null,null,null,null,null,0,0,0,0,0,0,0,0,0,0,0,0,null,0,0,{"$f":"AA58+AB58","v":0}," ",null,null,{"$f":"IF(B58<>0,NORMDIST(B58,AVERAGE(B$57:B$66),STDEV(B$57:B$66),TRUE),CHAR(32))","v":" "}," "," "," "," "," "," "," "," "," "," "," "," ",{"$f":"IF(AS58 <> CHAR(32), RANK(AS58, AS$57:AS$66), CHAR(32))","v":" "}]
[null,null,null,null,null,null,null,null,null,null,null,null,null,0,0,0,0,0,0,0,0,0,0,0,0,null,0,0,0," ",null,null,{"$f":"IF(B59<>0,NORMDIST(B59,AVERAGE(B$57:B$66),STDEV(B$57:B$66),TRUE),CHAR(32))","v":" "}," "," "," "," "," "," "," "," "," "," "," "," "," "]
[null,null,null,null,null,null,null,null,null,null,null,null,null,0,0,0,0,0,0,0,0,0,0,0,0,null,0,0,0," ",null,null," "," "," "," "," "," "," "," "," "," "," "," "," "," "]
[null,null,null,null,null,null,null,null,null,null,null,null,null,0,0,0,0,0,0,0,0,0,0,0,0,null,0,0,0," ",null,null," "," "," "," "," "," "," "," "," "," "," "," "," "," "]
[null,null,null,null,null,null,null,null,null,null,null,null,null,0,0,0,0,0,0,0,0,0,0,0,0,null,0,0,0," ",null,null," "," "," "," "," "," "," "," "," "," "," "," "," "," "]
[null,null,null,null,null,null,null,null,null,null,null,null,null,0,0,0,0,0,0,0,0,0,0,0,0,null,0,0,0," ",null,null," "," "," "," "," "," "," "," "," "," "," "," "," "," "]
[null,null,null,null,null,null,null,null,null,null,null,null,null,0,0,0,0,0,0,0,0,0,0,0,0,null,0,0,0," ",null,null," "," "," "," "," "," "," "," "," "," "," "," "," "," "]
[null,null,null,null,null,null,null,null,null,null,null,null,null,0,0,0,0,0,0,0,0,0,0,0,0,null,0,0,0," ",null,null," "," "," "," "," "," "," "," "," "," "," "," "," "," "]
[null,null,null,null,null,null,null,null,null,null,null,null,null,0,0,0,0,0,0,0,0,0,0,0,0,null,0,0,0," ",null,null," "," "," "," "," "," "," "," "," "," "," "," "," "," "]
["Pool G","A1","T1","A2","T2","A3","T3","A4","T4","A5","T5","A6","T6","AA1","AT1","AA2","AT2","AA3","AT3","AA4","AT4","AA5","AT5","AA6","AT6",null,"Atot","Ttot","Tot","Rnk"]
[null,null,null,null,null,null,null,null,null,null,null,null,null,{"$f":"IF(B68<>0,RANK(B68,B$68:B$77),0)","v":0},{"$f":"IF(C68<>0,RANK(C68,C$68:C$77),0)","v":0},{"$f":"IF(D68<>0,RANK(D68,D$68:D$77),0)","v":0},{"$f":"IF(E68<>0,RANK(E68,E$68:E$77),0)","v":0},{"$f":"IF(F68<>0,RANK(F68,F$68:F$77),0)","v":0},{"$f":"IF(G68<>0,RANK(G68,G$68:G$77),0)","v":0},{"$f":"IF(H68<>0,RANK(H68,H$68:H$77),0)","v":0},{"$f":"IF(I68<>0,RANK(I68,I$68:I$77),0)","v":0},{"$f":"IF(J68<>0,RANK(J68,J$68:J$77),0)","v":0},{"$f":"IF(K68<>0,RANK(K68,K$68:K$77),0)","v":0},{"$f":"IF(L68<>0,RANK(L68,L$68:L$77),0)","v":0},{"$f":"IF(M68<>0,RANK(M68,M$68:M$77),0)","v":0},null,{"$f":"N68+P68+R68+T68+V68+X68","v":0},{"$f":"O68+Q68+S68+U68+W68+Y68","v":0},{"$f":"AA68+AB68","v":0},{"$f":"IF(AC68<>0,RANK(AC68,AC$68:AC$77,1)-10+COUNT(B$68:B$77),CHAR(32))","v":" "},null,null,{"$f":"IF(B68<>0,NORMDIST(B68,AVERAGE(B$68:B$77),STDEV(B$68:B$77),TRUE),CHAR(32))","v":" "},{"$f":"IF(C68<>0,NORMDIST(C68,AVERAGE(C$68:C$77),STDEV(C$68:C$77),TRUE),CHAR(32))","v":" "},{"$f":"IF(D68<>0,NORMDIST(D68,AVERAGE(D$68:D$77),STDEV(D$68:D$77),TRUE),CHAR(32))","v":" "},{"$f":"IF(E68<>0,NORMDIST(E68,AVERAGE(E$68:E$77),STDEV(E$68:E$77),TRUE),CHAR(32))","v":" "},{"$f":"IF(F68<>0,NORMDIST(F68,AVERAGE(F$68:F$77),STDEV(F$68:F$77),TRUE),CHAR(32))","v":" "},{"$f":"IF(G68<>0,NORMDIST(G68,AVERAGE(G$68:G$77),STDEV(G$68:G$77),TRUE),CHAR(32))","v":" "},{"$f":"IF(H68<>0,NORMDIST(H68,AVERAGE(H$68:H$77),STDEV(H$68:H$77),TRUE),CHAR(32))","v":" "},{"$f":"IF(I68<>0,NORMDIST(I68,AVERAGE(I$68:I$77),STDEV(I$68:I$77),TRUE),CHAR(32))","v":" "},{"$f":"IF(J68<>0,NORMDIST(J68,AVERAGE(J$68:J$77),STDEV(J$68:J$77),TRUE),CHAR(32))","v":" "},{"$f":"IF(K68<>0,NORMDIST(K68,AVERAGE(K$68:K$77),STDEV(K$68:K$77),TRUE),CHAR(32))","v":" "},{"$f":"IF(L68<>0,NORMDIST(L68,AVERAGE(L$68:L$77),STDEV(L$68:L$77),TRUE),CHAR(32))","v":" "},{"$f":"IF(M68<>0,NORMDIST(M68,AVERAGE(M$68:M$77),STDEV(M$68:M$77),TRUE),CHAR(32))","v":" "}," ",{"$f":"IF(AS68 <> CHAR(32), RANK(AS68, AS$68:AS$77), CHAR(32))","v":" "}]
[null,null,null,null,null,null,null,null,null,null,null,null,null,0,0,0,0,0,0,0,0,0,0,0,0,null,0,0,{"$f":"AA69+AB69","v":0}," ",null,null,{"$f":"IF(B69<>0,NORMDIST(B69,AVERAGE(B$68:B$77),STDEV(B$68:B$77),TRUE),CHAR(32))","v":" "}," "," "," "," "," "," "," "," "," "," "," ",{"$f":"IF(SUM(AG69:AR69)> 0,SUM(AG69:AR69), CHAR(32))","v":" "},{"$f":"IF(AS69 <> CHAR(32), RANK(AS69, AS$68:AS$77), CHAR(32))","v":" "}]
[null,null,null,null,null,null,null,null,null,null,null,null,null,0,0,0,0,0,0,0,0,0,0,0,0,null,0,0,0," ",null,null,{"$f":"IF(B70<>0,NORMDIST(B70,AVERAGE(B$68:B$77),STDEV(B$68:B$77),TRUE),CHAR(32))","v":" "}," "," "," "," "," "," "," "," "," "," "," "," "," "]
[null,null,null,null,null,null,null,null,null,null,null,null,null,0,0,0,0,0,0,0,0,0,0,0,0,null,0,0,0," ",null,null," "," "," "," "," "," "," "," "," "," "," "," "," "," "]
[null,null,null,null,null,null,null,null,null,null,null,null,null,0,0,0,0,0,0,0,0,0,0,0,0,null,0,0,0," ",null,null," "," "," "," "," "," "," "," "," "," "," "," "," "," "]
[null,null,null,null,null,null,null,null,null,null,null,null,null,0,0,0,0,0,0,0,0,0,0,0,0,null,0,0,0," ",null,null," "," "," "," "," "," "," "," "," "," "," "," "," "," "]
[null,null,null,null,null,null,null,null,null,null,null,null,null,0,0,0,0,0,0,0,0,0,0,0,0,null,0,0,0," ",null,null," "," "," "," "," "," "," "," "," "," "," "," "," "," "]
[null,null,null,null,null,null,null,null,null,null,null,null,null,0,0,0,0,0,0,0,0,0,0,0,0,null,0,0,0," ",null,null," "," "," "," "," "," "," "," "," "," "," "," "," "," "]
[null,null,null,null,null,null,null,null,null,null,null,null,null,0,0,0,0,0,0,0,0,0,0,0,0,null,0,0,0," ",null,null," "," "," "," "," "," "," "," "," "," "," "," "," "," "]
[null,null,null,null,null,null,null,null,null,null,null,null,null,0,0,0,0,0,0,0,0,0,0,0,0,null,0,0,0," ",null,null," "," "," "," "," "," "," "," "," "," "," "," "," "," "]
["Pool H","A1","T1","A2","T2","A3","T3","A4","T4","A5","T5","A6","T6","AA1","AT1","AA2","AT2","AA3","AT3","AA4","AT4","AA5","AT5","AA6","AT6",null,"Atot","Ttot","Tot","Rnk"]
[null,null,null,null,null,null,null,null,null,null,null,null,null,{"$f":"IF(B79<>0,RANK(B79,B$79:B$88),0)","v":0},{"$f":"IF(C79<>0,RANK(C79,C$79:C$88),0)","v":0},{"$f":"IF(D79<>0,RANK(D79,D$79:D$88),0)","v":0},{"$f":"IF(E79<>0,RANK(E79,E$79:E$88),0)","v":0},{"$f":"IF(F79<>0,RANK(F79,F$79:F$88),0)","v":0},{"$f":"IF(G79<>0,RANK(G79,G$79:G$88),0)","v":0},{"$f":"IF(H79<>0,RANK(H79,H$79:H$88),0)","v":0},{"$f":"IF(I79<>0,RANK(I79,I$79:I$88),0)","v":0},{"$f":"IF(J79<>0,RANK(J79,J$79:J$88),0)","v":0},{"$f":"IF(K79<>0,RANK(K79,K$79:K$88),0)","v":0},{"$f":"IF(L79<>0,RANK(L79,L$79:L$88),0)","v":0},{"$f":"IF(M79<>0,RANK(M79,M$79:M$88),0)","v":0},null,{"$f":"N79+P79+R79+T79+V79+X79","v":0},{"$f":"O79+Q79+S79+U79+W79+Y79","v":0},{"$f":"AA79+AB79","v":0},{"$f":"IF(AC79<>0,RANK(AC79,AC$79:AC$88,1)-10+COUNT(B$79:B$88),CHAR(32))","v":" "},null,null,{"$f":"IF(B79<>0,NORMDIST(B79,AVERAGE(B$79:B$88),STDEV(B$79:B$88),TRUE),CHAR(32))","v":" "},{"$f":"IF(C79<>0,NORMDIST(C79,AVERAGE(C$79:C$88),STDEV(C$79:C$88),TRUE),CHAR(32))","v":" "},{"$f":"IF(D79<>0,NORMDIST(D79,AVERAGE(D$79:D$88),STDEV(D$79:D$88),TRUE),CHAR(32))","v":" "},{"$f":"IF(E79<>0,NORMDIST(E79,AVERAGE(E$79:E$88),STDEV(E$79:E$88),TRUE),CHAR(32))","v":" "},{"$f":"IF(F79<>0,NORMDIST(F79,AVERAGE(F$79:F$88),STDEV(F$79:F$88),TRUE),CHAR(32))","v":" "},{"$f":"IF(G79<>0,NORMDIST(G79,AVERAGE(G$79:G$88),STDEV(G$79:G$88),TRUE),CHAR(32))","v":" "},{"$f":"IF(H79<>0,NORMDIST(H79,AVERAGE(H$79:H$88),STDEV(H$79:H$88),TRUE),CHAR(32))","v":" "},{"$f":"IF(I79<>0,NORMDIST(I79,AVERAGE(I$79:I$88),STDEV(I$79:I$88),TRUE),CHAR(32))","v":" "},{"$f":"IF(J79<>0,NORMDIST(J79,AVERAGE(J$79:J$88),STDEV(J$79:J$88),TRUE),CHAR(32))","v":" "},{"$f":"IF(K79<>0,NORMDIST(K79,AVERAGE(K$79:K$88),STDEV(K$79:K$88),TRUE),CHAR(32))","v":" "},{"$f":"IF(L79<>0,NORMDIST(L79,AVERAGE(L$79:L$88),STDEV(L$79:L$88),TRUE),CHAR(32))","v":" "},{"$f":"IF(M79<>0,NORMDIST(M79,AVERAGE(M$79:M$88),STDEV(M$79:M$88),TRUE),CHAR(32))","v":" "},{"$f":"IF(SUM(AG79:AR79)> 0,SUM(AG79:AR79), CHAR(32))","v":" "},{"$f":"IF(AS79 <> CHAR(32), RANK(AS79, AS$79:AS$88), CHAR(32))","v":" "}]
[null,null,null,null,null,null,null,null,null,null,null,null,null,0,0,0,0,0,0,0,0,0,0,0,0,null,0,0,0," ",null,null,{"$f":"IF(B80<>0,NORMDIST(B80,AVERAGE(B$79:B$88),STDEV(B$79:B$88),TRUE),CHAR(32))","v":" "}," "," "," "," "," "," "," "," "," "," "," "," ",{"$f":"IF(AS80 <> CHAR(32), RANK(AS80, AS$79:AS$88), CHAR(32))","v":" "}]
[null,null,null,null,null,null,null,null,null,null,null,null,null,0,0,0,0,0,0,0,0,0,0,0,0,null,0,0,0," ",null,null,{"$f":"IF(B81<>0,NORMDIST(B81,AVERAGE(B$79:B$88),STDEV(B$79:B$88),TRUE),CHAR(32))","v":" "}," "," "," "," "," "," "," "," "," "," "," "," "," "]
[null,null,null,null,null,null,null,null,null,null,null,null,null,0,0,0,0,0,0,0,0,0,0,0,0,null,0,0,0," ",null,null," "," "," "," "," "," "," "," "," "," "," "," "," "," "]
[null,null,null,null,null,null,null,null,null,null,null,null,null,0,0,0,0,0,0,0,0,0,0,0,0,null,0,0,0," ",null,null," "," "," "," "," "," "," "," "," "," "," "," "," "," "]
[null,null,null,null,null,null,null,null,null,null,null,null,null,0,0,0,0,0,0,0,0,0,0,0,0,null,0,0,0," ",null,null," "," "," "," "," "," "," "," "," "," "," "," "," "," "]
[null,null,null,null,null,null,null,null,null,null,null,null,null,0,0,0,0,0,0,0,0,0,0,0,0,null,0,0,0," ",null,null," "," "," "," "," "," "," "," "," "," "," "," "," "," "]
[null,null,null,null,null,null,null,null,null,null,null,null,null,0,0,0,0,0,0,0,0,0,0,0,0,null,0,0,0," ",null,null," "," "," "," "," "," "," "," "," "," "," "," "," "," "]
[null,null,null,null,null,null,null,null,null,null,null,null,null,0,0,0,0,0,0,0,0,0,0,0,0,null,0,0,0," ",null,null," "," "," "," "," "," "," "," "," "," "," "," "," "," "]
[null,null,null,null,null,null,null,null,null,null,null,null,null,0,0,0,0,0,0,0,0,0,0,0,0,null,0,0,{"$f":"AA88+AB88","v":0}," "]

{"sheet":"ResPrint","index":4,"n_rows":29,"n_cols":5,"rows_kept":29,"cut":false,"hidden":false,"merged":[[0,1,0,4],[2,1,2,4]]}
[null,{"$f":"Seeding!H5","v":"2012 IFPA U.S. Open Freestyle Championships"}]
[]
[null,{"$f":"CONCATENATE(Seeding!H6,\" - Results\")","v":"Open Singles Routines - Round 1 - Results"}]
[]
[null,"Pool A","Pool B","Pool C","Pool D"]
[null,"Player 2","Player 1","",""]
[null,"Player 3","Player 4","",""]
[null,"Player 7","Player 9","",""]
[null,"Player 10","Player 8","",""]
[null,"Player 6","Player 5","",""]
[null,"","","",""]
[null,"","","",""]
[null,"","","",""]
[null,"","","",""]
[null,"","","",""]
[]
[null,"Pool E","Pool F","Pool G","Pool G"]
[null,"","","",""]
[null,"","","",""]
[null,"","","",""]
[null,"","","",""]
[null,"","","",""]
[null,"","","",""]
[null,"","","",""]
[null,"","","",""]
[null,"","","",""]
[null,"","","",""]
[]
[null,"*Warning: in the presence of ties, this software does not currently show the correct result -- ties must be resolved using the normalization scores on the Scoring sheet."]

{"sheet":"Results","index":5,"n_rows":81,"n_cols":4,"rows_kept":81,"cut":false,"hidden":false,"merged":[]}
[null,"Name","Pool","Rank"]
[1,{"$f":"IF(Scoring!A11<>\"\",Scoring!A11,\"\")","v":"Player 2"},"A",{"$f":"Scoring!AD11","v":" "}]
[2,{"$f":"IF(Scoring!A10<>\"\",Scoring!A10,\"\")","v":"Player 3"},"A",{"$f":"Scoring!AD10","v":" "}]
[3,{"$f":"IF(Scoring!A8<>\"\",Scoring!A8,\"\")","v":"Player 7"},"A",{"$f":"Scoring!AD8","v":" "}]
[4,{"$f":"IF(Scoring!A7<>\"\",Scoring!A7,\"\")","v":"Player 10"},"A",{"$f":"Scoring!AD7","v":" "}]
[5,{"$f":"IF(Scoring!A9<>\"\",Scoring!A9,\"\")","v":"Player 6"},"A",{"$f":"Scoring!AD9","v":" "}]
[6,{"$f":"IF(Scoring!A6<>\"\",Scoring!A6,\"\")","v":""},"A",{"$f":"Scoring!AD6","v":" "}]
[7,{"$f":"IF(Scoring!A5<>\"\",Scoring!A5,\"\")","v":""},"A",{"$f":"Scoring!AD5","v":" "}]
[8,{"$f":"IF(Scoring!A4<>\"\",Scoring!A4,\"\")","v":""},"A",{"$f":"Scoring!AD4","v":" "}]
[9,{"$f":"IF(Scoring!A2<>\"\",Scoring!A2,\"\")","v":""},"A",{"$f":"Scoring!AD2","v":" "}]
[10,{"$f":"IF(Scoring!A3<>\"\",Scoring!A3,\"\")","v":""},"A",{"$f":"Scoring!AD3","v":" "}]
[11,{"$f":"IF(Scoring!A22<>\"\",Scoring!A22,\"\")","v":"Player 1"},"B",{"$f":"Scoring!AD22","v":" "}]
[12,{"$f":"IF(Scoring!A21<>\"\",Scoring!A21,\"\")","v":"Player 4"},"B",{"$f":"Scoring!AD21","v":" "}]
[13,{"$f":"IF(Scoring!A18<>\"\",Scoring!A18,\"\")","v":"Player 9"},"B",{"$f":"Scoring!AD18","v":" "}]
[14,{"$f":"IF(Scoring!A19<>\"\",Scoring!A19,\"\")","v":"Player 8"},"B",{"$f":"Scoring!AD19","v":" "}]
[15,{"$f":"IF(Scoring!A20<>\"\",Scoring!A20,\"\")","v":"Player 5"},"B",{"$f":"Scoring!AD20","v":" "}]
[16,{"$f":"IF(Scoring!A17<>\"\",Scoring!A17,\"\")","v":""},"B",{"$f":"Scoring!AD17","v":" "}]
[17,{"$f":"IF(Scoring!A15<>\"\",Scoring!A15,\"\")","v":""},"B",{"$f":"Scoring!AD15","v":" "}]
[18,{"$f":"IF(Scoring!A16<>\"\",Scoring!A16,\"\")","v":""},"B",{"$f":"Scoring!AD16","v":" "}]
[19,{"$f":"IF(Scoring!A13<>\"\",Scoring!A13,\"\")","v":""},"B",{"$f":"Scoring!AD13","v":" "}]
[20,{"$f":"IF(Scoring!A14<>\"\",Scoring!A14,\"\")","v":""},"B",{"$f":"Scoring!AD14","v":" "}]
[21,{"$f":"IF(Scoring!A33<>\"\",Scoring!A33,\"\")","v":""},"C",{"$f":"Scoring!AD33","v":" "}]
[22,{"$f":"IF(Scoring!A32<>\"\",Scoring!A32,\"\")","v":""},"C",{"$f":"Scoring!AD32","v":" "}]
[23,{"$f":"IF(Scoring!A31<>\"\",Scoring!A31,\"\")","v":""},"C",{"$f":"Scoring!AD31","v":" "}]
[24,{"$f":"IF(Scoring!A30<>\"\",Scoring!A30,\"\")","v":""},"C",{"$f":"Scoring!AD30","v":" "}]
[25,{"$f":"IF(Scoring!A29<>\"\",Scoring!A29,\"\")","v":""},"C",{"$f":"Scoring!AD29","v":" "}]
[26,{"$f":"IF(Scoring!A27<>\"\",Scoring!A27,\"\")","v":""},"C",{"$f":"Scoring!AD27","v":" "}]
[27,{"$f":"IF(Scoring!A28<>\"\",Scoring!A28,\"\")","v":""},"C",{"$f":"Scoring!AD28","v":" "}]
[28,{"$f":"IF(Scoring!A26<>\"\",Scoring!A26,\"\")","v":""},"C",{"$f":"Scoring!AD26","v":" "}]
[29,{"$f":"IF(Scoring!A24<>\"\",Scoring!A24,\"\")","v":""},"C",{"$f":"Scoring!AD24","v":" "}]
[30,{"$f":"IF(Scoring!A25<>\"\",Scoring!A25,\"\")","v":""},"C",{"$f":"Scoring!AD25","v":" "}]
[31,{"$f":"IF(Scoring!A44<>\"\",Scoring!A44,\"\")","v":""},"D",{"$f":"Scoring!AD44","v":" "}]
[32,{"$f":"IF(Scoring!A43<>\"\",Scoring!A43,\"\")","v":""},"D",{"$f":"Scoring!AD43","v":" "}]
[33,{"$f":"IF(Scoring!A42<>\"\",Scoring!A42,\"\")","v":""},"D",{"$f":"Scoring!AD42","v":" "}]
[34,{"$f":"IF(Scoring!A41<>\"\",Scoring!A41,\"\")","v":""},"D",{"$f":"Scoring!AD41","v":" "}]
[35,{"$f":"IF(Scoring!A40<>\"\",Scoring!A40,\"\")","v":""},"D",{"$f":"Scoring!AD40","v":" "}]
[36,{"$f":"IF(Scoring!A39<>\"\",Scoring!A39,\"\")","v":""},"D",{"$f":"Scoring!AD39","v":" "}]
[37,{"$f":"IF(Scoring!A36<>\"\",Scoring!A36,\"\")","v":""},"D",{"$f":"Scoring!AD36","v":" "}]
[38,{"$f":"IF(Scoring!A37<>\"\",Scoring!A37,\"\")","v":""},"D",{"$f":"Scoring!AD37","v":" "}]
[39,{"$f":"IF(Scoring!A38<>\"\",Scoring!A38,\"\")","v":""},"D",{"$f":"Scoring!AD38","v":" "}]
[40,{"$f":"IF(Scoring!A35<>\"\",Scoring!A35,\"\")","v":""},"D",{"$f":"Scoring!AD35","v":" "}]
[41,{"$f":"IF(Scoring!A54<>\"\",Scoring!A54,\"\")","v":""},"E",{"$f":"Scoring!AD54","v":" "}]
[42,{"$f":"IF(Scoring!A53<>\"\",Scoring!A53,\"\")","v":""},"E",{"$f":"Scoring!AD53","v":" "}]
[43,{"$f":"IF(Scoring!A52<>\"\",Scoring!A52,\"\")","v":""},"E",{"$f":"Scoring!AD52","v":" "}]
[44,{"$f":"IF(Scoring!A55<>\"\",Scoring!A55,\"\")","v":""},"E",{"$f":"Scoring!AD55","v":" "}]
[45,{"$f":"IF(Scoring!A51<>\"\",Scoring!A51,\"\")","v":""},"E",{"$f":"Scoring!AD51","v":" "}]
[46,{"$f":"IF(Scoring!A50<>\"\",Scoring!A50,\"\")","v":""},"E",{"$f":"Scoring!AD50","v":" "}]
[47,{"$f":"IF(Scoring!A49<>\"\",Scoring!A49,\"\")","v":""},"E",{"$f":"Scoring!AD49","v":" "}]
[48,{"$f":"IF(Scoring!A46<>\"\",Scoring!A46,\"\")","v":""},"E",{"$f":"Scoring!AD46","v":" "}]
[49,{"$f":"IF(Scoring!A47<>\"\",Scoring!A47,\"\")","v":""},"E",{"$f":"Scoring!AD47","v":" "}]
[50,{"$f":"IF(Scoring!A48<>\"\",Scoring!A48,\"\")","v":""},"E",{"$f":"Scoring!AD48","v":" "}]
[51,{"$f":"IF(Scoring!A57<>\"\",Scoring!A57,\"\")","v":""},"F",{"$f":"Scoring!AD57","v":" "}]
[52,{"$f":"IF(Scoring!A58<>\"\",Scoring!A58,\"\")","v":""},"F",{"$f":"Scoring!AD58","v":" "}]
[53,{"$f":"IF(Scoring!A59<>\"\",Scoring!A59,\"\")","v":""},"F",{"$f":"Scoring!AD59","v":" "}]
[54,{"$f":"IF(Scoring!A60<>\"\",Scoring!A60,\"\")","v":""},"F",{"$f":"Scoring!AD60","v":" "}]
[55,{"$f":"IF(Scoring!A61<>\"\",Scoring!A61,\"\")","v":""},"F",{"$f":"Scoring!AD61","v":" "}]
[56,{"$f":"IF(Scoring!A62<>\"\",Scoring!A62,\"\")","v":""},"F",{"$f":"Scoring!AD62","v":" "}]
[57,{"$f":"IF(Scoring!A63<>\"\",Scoring!A63,\"\")","v":""},"F",{"$f":"Scoring!AD63","v":" "}]
[58,{"$f":"IF(Scoring!A64<>\"\",Scoring!A64,\"\")","v":""},"F",{"$f":"Scoring!AD64","v":" "}]
[59,{"$f":"IF(Scoring!A65<>\"\",Scoring!A65,\"\")","v":""},"F",{"$f":"Scoring!AD65","v":" "}]
[60,{"$f":"IF(Scoring!A66<>\"\",Scoring!A66,\"\")","v":""},"F",{"$f":"Scoring!AD66","v":" "}]
[61,{"$f":"IF(Scoring!A68<>\"\",Scoring!A68,\"\")","v":""},"G",{"$f":"Scoring!AD68","v":" "}]
[62,{"$f":"IF(Scoring!A69<>\"\",Scoring!A69,\"\")","v":""},"G",{"$f":"Scoring!AD69","v":" "}]
[63,{"$f":"IF(Scoring!A70<>\"\",Scoring!A70,\"\")","v":""},"G",{"$f":"Scoring!AD70","v":" "}]
[64,{"$f":"IF(Scoring!A71<>\"\",Scoring!A71,\"\")","v":""},"G",{"$f":"Scoring!AD71","v":" "}]
[65,{"$f":"IF(Scoring!A72<>\"\",Scoring!A72,\"\")","v":""},"G",{"$f":"Scoring!AD72","v":" "}]
[66,{"$f":"IF(Scoring!A73<>\"\",Scoring!A73,\"\")","v":""},"G",{"$f":"Scoring!AD73","v":" "}]
[67,{"$f":"IF(Scoring!A74<>\"\",Scoring!A74,\"\")","v":""},"G",{"$f":"Scoring!AD74","v":" "}]
[68,{"$f":"IF(Scoring!A75<>\"\",Scoring!A75,\"\")","v":""},"G",{"$f":"Scoring!AD75","v":" "}]
[69,{"$f":"IF(Scoring!A76<>\"\",Scoring!A76,\"\")","v":""},"G",{"$f":"Scoring!AD76","v":" "}]
[70,{"$f":"IF(Scoring!A77<>\"\",Scoring!A77,\"\")","v":""},"G",{"$f":"Scoring!AD77","v":" "}]
[71,{"$f":"IF(Scoring!A79<>\"\",Scoring!A79,\"\")","v":""},"H",{"$f":"Scoring!AD79","v":" "}]
[72,{"$f":"IF(Scoring!A80<>\"\",Scoring!A80,\"\")","v":""},"H",{"$f":"Scoring!AD80","v":" "}]
[73,{"$f":"IF(Scoring!A81<>\"\",Scoring!A81,\"\")","v":""},"H",{"$f":"Scoring!AD81","v":" "}]
[74,{"$f":"IF(Scoring!A82<>\"\",Scoring!A82,\"\")","v":""},"H",{"$f":"Scoring!AD82","v":" "}]
[75,{"$f":"IF(Scoring!A83<>\"\",Scoring!A83,\"\")","v":""},"H",{"$f":"Scoring!AD83","v":" "}]
[76,{"$f":"IF(Scoring!A84<>\"\",Scoring!A84,\"\")","v":""},"H",{"$f":"Scoring!AD84","v":" "}]
[77,{"$f":"IF(Scoring!A85<>\"\",Scoring!A85,\"\")","v":""},"H",{"$f":"Scoring!AD85","v":" "}]
[78,{"$f":"IF(Scoring!A86<>\"\",Scoring!A86,\"\")","v":""},"H",{"$f":"Scoring!AD86","v":" "}]
[79,{"$f":"IF(Scoring!A87<>\"\",Scoring!A87,\"\")","v":""},"H",{"$f":"Scoring!AD87","v":" "}]
[80,{"$f":"IF(Scoring!A88<>\"\",Scoring!A88,\"\")","v":""},"H",{"$f":"Scoring!AD88","v":" "}]

{"sheet":"ToDo","index":6,"n_rows":4,"n_cols":1,"rows_kept":4,"cut":false,"hidden":false,"merged":[]}
[]
["total results"]
["prepare next round"]
["incorret hiding of results"]